{"text_format":"1","workbook":"xlsx","n_sheets":6,"sheets":["Resultados Gerais","Total de Saídas de Cada Dezena","10 Últimos Sorteios","20 Últimos Sorteios","50 Últimos Sorteios","100 Últimos Sorteios"],"not_rendered":{"charts":1,"images":3,"macros":1,"external_links":0,"defined_names":6,"comments":0,"pivot_tables":0},"unopened":[],"bounds":{"document_bytes":16777216,"sheet_cells":100000,"rows_first":2000,"rows_last":500,"rows_between":2000,"halvings":0,"cell_chars":16384,"cell_head_chars":4096},"cells_cut":0,"cells_raw":0,"read":"whole","date_system":"1900"}

{"sheet":"Resultados Gerais","index":0,"n_rows":3317,"n_cols":19,"rows_kept":3317,"cut":false,"hidden":false,"merged":[[1,1,1,12],[2,1,2,12],[3,1,3,12],[5,1,5,12]]}
[]
[null,"Atenção!"]
[null,"Esta planilha é de uso pessoal, é restritamente proibida a distribuição da mesma a terceiros, sujeito a punições de acordo com as leis de direitos autorais"]
[null,"Todos os direitos reservados ao site www.ApostaEsperta.com "]
[]
[null,"Planilha de Análise Estatística Quina"]
[null,"Concurso","Data Sorteio","1ª Dezena","2ª Dezena","3ª Dezena","4ª Dezena","5ª Dezena","Arrecadacao_Total","Ganhadores_Quina","Rateio_Quina","Ganhadores_Quadra","Rateio_Quadra","Ganhadores_Terno","Rateio_Terno","Acumulado","Valor_Acumulado","Estimativa_Premio","Valor_Acumulado_Sorteio_Especial_São_João"]
[null,1,"1994-03-13",25,45,60,76,79,0,3,0,127,75731225,7030,1788927,"NÃO",42982,0,0]
[null,2,"1994-03-17",13,30,58,63,64,0,1,0,105,118499397,4861,1128565,"NÃO",32422,0,0]
[null,3,"1994-03-20",5,15,32,33,48,0,1,0,232,154244270,10196,664846,"NÃO",20120,0,0]
[null,4,"1994-03-24",27,57,60,61,77,0,1,0,78,124185246,4033,1592119,"NÃO",40954,0,0]
[null,5,"1994-03-27",19,44,53,54,71,0,1,0,137,147595715,5338,1077341,"NÃO",36774,0,0]
[null,6,"1994-04-03",4,45,54,65,67,0,1,0,157,165397879,7286,1053490,"NÃO",30192,0,0]
[null,7,"1994-04-07",9,21,37,42,68,0,2,0,153,77956048,5621,1019033,"NÃO",36891,0,0]
[null,8,"1994-04-10",5,16,26,28,62,0,0,215049006,178,0,8290,1208140,"SIM",34501,0,0]
{"$rows_left_out":3303}
{"sheet":"Total de Saídas de Cada Dezena","index":1,"n_rows":87,"n_cols":3,"rows_kept":87,"cut":false,"hidden":false,"merged":[[1,1,1,19],[2,1,2,19],[3,1,3,19],[5,1,5,19]]}
[]
[null,"Atenção!"]
[null,"Esta planilha é de uso pessoal, é restritamente proibida a distribuição da mesma a terceiros, sujeito a punições de acordo com as leis de direitos autorais"]
[null,"Todos os direitos reservados ao site www.ApostaEsperta.com "]
[]
[null,"Planilha de Análise Estatística Quina"]
[null,"Dezena","Total de saidas"]
[null,1,{"$f":"COUNTIF('Resultados Gerais'!$D8:$H1048576,B8)","v":206}]
[null,2,{"$f":"COUNTIF('Resultados Gerais'!$D8:$H1048576,B9)","v":199}]
[null,3,{"$f":"COUNTIF('Resultados Gerais'!$D8:$H1048576,B10)","v":188}]
[null,4,{"$f":"COUNTIF('Resultados Gerais'!$D8:$H1048576,B11)","v":235}]
[null,5,{"$f":"COUNTIF('Resultados Gerais'!$D8:$H1048576,B12)","v":217}]
[null,6,{"$f":"COUNTIF('Resultados Gerais'!$D8:$H1048576,B13)","v":184}]
[null,7,{"$f":"COUNTIF('Resultados Gerais'!$D8:$H1048576,B14)","v":204}]
[null,8,{"$f":"COUNTIF('Resultados Gerais'!$D8:$H1048576,B15)","v":198}]
{"$rows_left_out":73}
{"sheet":"10 Últimos Sorteios","index":2,"n_rows":91,"n_cols":15,"rows_kept":91,"cut":false,"hidden":false,"merged":[[8,2,9,8],[8,12,9,13],[5,1,5,16],[1,1,1,16],[2,1,2,16],[3,1,3,16]]}
[]
[null,"Atenção!"]
[null,"Esta planilha é de uso pessoal, é restritamente proibida a distribuição da mesma a terceiros, sujeito a punições de acordo com as leis de direitos autorais"]
[null,"Todos os direitos reservados ao site www.ApostaEsperta.com "]
[]
[null,"Planilha de Análise Estatística Quina"]
[]
[]
[null,null,"Resultados dos Últimos 10 Sorteios",null,null,null,null,null,null,null,null,null,"Números Quentes \nÚltimos 10 Sorteios"]
[]
[null,null,"Sorteio","Data do Sorteio","1ª Dezena","2ª Dezena","3ª Dezena","4ª Dezena","5ª Dezena",null,null,null,"Dezena","Qtd Saídas"]
[null,null,{"$f":"COUNT('Resultados Gerais'!B8:B1048576)","v":3310},{"$f":"VLOOKUP(C12,'Resultados Gerais'!B:T,2,0)","v":"2013-10-07"},{"$f":"VLOOKUP(C12,'Resultados Gerais'!$B7:$S1048576,3,0)","v":19},{"$f":"VLOOKUP($C12,'Resultados Gerais'!$B8:$S1048576,4,0)","v":43},{"$f":"VLOOKUP($C12,'Resultados Gerais'!$B7:$S1048576,5,0)","v":39},{"$f":"VLOOKUP($C12,'Resultados Gerais'!$B7:$S1048576,6,0)","v":17},{"$f":"VLOOKUP($C12,'Resultados Gerais'!$B7:$S1048576,7,0)","v":54},null,null,null,31,{"$f":"COUNTIF($E$12:$I$22,M12)","v":3},{"$f":"COUNTIF($E$12:$I$22,M12)","v":3}]
[null,null,{"$f":"COUNT('Resultados Gerais'!B8:B1048576)-1","v":3309},{"$f":"VLOOKUP(C13,'Resultados Gerais'!B:T,2,0)","v":"2013-10-05"},{"$f":"VLOOKUP($C13,'Resultados Gerais'!$B8:$S1048576,3,0)","v":18},{"$f":"VLOOKUP($C13,'Resultados Gerais'!$B8:$S1048576,4,0)","v":27},{"$f":"VLOOKUP($C13,'Resultados Gerais'!$B8:$S1048576,5,0)","v":22},{"$f":"VLOOKUP($C13,'Resultados Gerais'!$B8:$S1048576,6,0)","v":2},{"$f":"VLOOKUP($C13,'Resultados Gerais'!$B8:$S1048576,7,0)","v":68},null,null,null,4,{"$f":"COUNTIF($E$12:$I$22,M13)","v":2},2]
[null,null,{"$f":"COUNT('Resultados Gerais'!B8:B1048576)-2","v":3308},{"$f":"VLOOKUP(C14,'Resultados Gerais'!B:T,2,0)","v":"2013-10-04"},{"$f":"VLOOKUP($C14,'Resultados Gerais'!$B8:$S1048576,3,0)","v":71},{"$f":"VLOOKUP($C14,'Resultados Gerais'!$B8:$S1048576,4,0)","v":32},{"$f":"VLOOKUP($C14,'Resultados Gerais'!$B8:$S1048576,5,0)","v":15},{"$f":"VLOOKUP($C14,'Resultados Gerais'!$B8:$S1048576,6,0)","v":45},{"$f":"VLOOKUP($C14,'Resultados Gerais'!$B8:$S1048576,7,0)","v":17},null,null,null,19,{"$f":"COUNTIF($E$12:$I$22,M14)","v":2},2]
[null,null,{"$f":"COUNT('Resultados Gerais'!B8:B1048576)-3","v":3307},{"$f":"VLOOKUP(C15,'Resultados Gerais'!B:T,2,0)","v":"2013-10-03"},{"$f":"VLOOKUP($C15,'Resultados Gerais'!$B8:$S1048576,3,0)","v":7},{"$f":"VLOOKUP($C15,'Resultados Gerais'!$B8:$S1048576,4,0)","v":59},{"$f":"VLOOKUP($C15,'Resultados Gerais'!$B8:$S1048576,5,0)","v":31},{"$f":"VLOOKUP($C15,'Resultados Gerais'!$B8:$S1048576,6,0)","v":26},{"$f":"VLOOKUP($C15,'Resultados Gerais'!$B8:$S1048576,7,0)","v":76},null,null,null,54,{"$f":"COUNTIF($E$12:$I$22,M15)","v":2},2]
{"$rows_left_out":77}
{"sheet":"20 Últimos Sorteios","index":3,"n_rows":91,"n_cols":15,"rows_kept":91,"cut":false,"hidden":false,"merged":[[8,2,9,8],[8,12,9,13],[1,1,1,16],[2,1,2,16],[3,1,3,16],[5,1,5,16]]}
[]
[null,"Atenção!"]
[null,"Esta planilha é de uso pessoal, é restritamente proibida a distribuição da mesma a terceiros, sujeito a punições de acordo com as leis de direitos autorais"]
[null,"Todos os direitos reservados ao site www.ApostaEsperta.com "]
[]
[null,"Planilha de Análise Estatística Quina"]
[]
[]
[null,null,"Resultados dos Últimos 20 Sorteios",null,null,null,null,null,null,null,null,null,"Números Quentes \nÚltimos 10 Sorteios"]
[]
[null,null,"Sorteio","Data do Sorteio","1ª Dezena","2ª Dezena","3ª Dezena","4ª Dezena","5ª Dezena",null,null,null,"Dezena","Qtd Saídas"]
[null,null,{"$f":"COUNT('Resultados Gerais'!B8:B1048576)","v":3310},{"$f":"VLOOKUP(C12,'Resultados Gerais'!B:T,2,0)","v":"2013-10-07"},{"$f":"VLOOKUP(C12,'Resultados Gerais'!$B7:$S1048576,3,0)","v":19},{"$f":"VLOOKUP($C12,'Resultados Gerais'!$B8:$S1048576,4,0)","v":43},{"$f":"VLOOKUP($C12,'Resultados Gerais'!$B7:$S1048576,5,0)","v":39},{"$f":"VLOOKUP($C12,'Resultados Gerais'!$B7:$S1048576,6,0)","v":17},{"$f":"VLOOKUP($C12,'Resultados Gerais'!$B7:$S1048576,7,0)","v":54},null,null,null,17,{"$f":"COUNTIF($E$12:$I$32,M12)","v":4},{"$f":"COUNTIF($E$12:$I$32,M12)","v":4}]
[null,null,{"$f":"COUNT('Resultados Gerais'!B8:B1048576)-1","v":3309},{"$f":"VLOOKUP(C13,'Resultados Gerais'!B:T,2,0)","v":"2013-10-05"},{"$f":"VLOOKUP($C13,'Resultados Gerais'!$B8:$S1048576,3,0)","v":18},{"$f":"VLOOKUP($C13,'Resultados Gerais'!$B8:$S1048576,4,0)","v":27},{"$f":"VLOOKUP($C13,'Resultados Gerais'!$B8:$S1048576,5,0)","v":22},{"$f":"VLOOKUP($C13,'Resultados Gerais'!$B8:$S1048576,6,0)","v":2},{"$f":"VLOOKUP($C13,'Resultados Gerais'!$B8:$S1048576,7,0)","v":68},null,null,null,31,{"$f":"COUNTIF($E$12:$I$32,M13)","v":4},4]
[null,null,{"$f":"COUNT('Resultados Gerais'!B8:B1048576)-2","v":3308},{"$f":"VLOOKUP(C14,'Resultados Gerais'!B:T,2,0)","v":"2013-10-04"},{"$f":"VLOOKUP($C14,'Resultados Gerais'!$B8:$S1048576,3,0)","v":71},{"$f":"VLOOKUP($C14,'Resultados Gerais'!$B8:$S1048576,4,0)","v":32},{"$f":"VLOOKUP($C14,'Resultados Gerais'!$B8:$S1048576,5,0)","v":15},{"$f":"VLOOKUP($C14,'Resultados Gerais'!$B8:$S1048576,6,0)","v":45},{"$f":"VLOOKUP($C14,'Resultados Gerais'!$B8:$S1048576,7,0)","v":17},null,null,null,73,{"$f":"COUNTIF($E$12:$I$32,M14)","v":4},4]
[null,null,{"$f":"COUNT('Resultados Gerais'!B8:B1048576)-3","v":3307},{"$f":"VLOOKUP(C15,'Resultados Gerais'!B:T,2,0)","v":"2013-10-03"},{"$f":"VLOOKUP($C15,'Resultados Gerais'!$B8:$S1048576,3,0)","v":7},{"$f":"VLOOKUP($C15,'Resultados Gerais'!$B8:$S1048576,4,0)","v":59},{"$f":"VLOOKUP($C15,'Resultados Gerais'!$B8:$S1048576,5,0)","v":31},{"$f":"VLOOKUP($C15,'Resultados Gerais'!$B8:$S1048576,6,0)","v":26},{"$f":"VLOOKUP($C15,'Resultados Gerais'!$B8:$S1048576,7,0)","v":76},null,null,null,2,{"$f":"COUNTIF($E$12:$I$32,M15)","v":3},3]
{"$rows_left_out":77}
{"sheet":"50 Últimos Sorteios","index":4,"n_rows":91,"n_cols":15,"rows_kept":91,"cut":false,"hidden":false,"merged":[[8,2,9,8],[8,12,9,13],[5,1,5,16],[1,1,1,16],[2,1,2,16],[3,1,3,16]]}
[]
[null,"Atenção!"]
[null,"Esta planilha é de uso pessoal, é restritamente proibida a distribuição da mesma a terceiros, sujeito a punições de acordo com as leis de direitos autorais"]
[null,"Todos os direitos reservados ao site www.ApostaEsperta.com "]
[]
[null,"Planilha de Análise Estatística Quina"]
[]
[]
[null,null,"Resultados dos Últimos 50 Sorteios",null,null,null,null,null,null,null,null,null,"Números Quentes \nÚltimos 10 Sorteios"]
[]
[null,null,"Sorteio","Data do Sorteio","1ª Dezena","2ª Dezena","3ª Dezena","4ª Dezena","5ª Dezena",null,null,null,"Dezena","Qtd Saídas"]
[null,null,{"$f":"COUNT('Resultados Gerais'!B8:B1048576)","v":3310},{"$f":"VLOOKUP(C12,'Resultados Gerais'!B:T,2,0)","v":"2013-10-07"},{"$f":"VLOOKUP(C12,'Resultados Gerais'!$B7:$S1048576,3,0)","v":19},{"$f":"VLOOKUP($C12,'Resultados Gerais'!$B8:$S1048576,4,0)","v":43},{"$f":"VLOOKUP($C12,'Resultados Gerais'!$B7:$S1048576,5,0)","v":39},{"$f":"VLOOKUP($C12,'Resultados Gerais'!$B7:$S1048576,6,0)","v":17},{"$f":"VLOOKUP($C12,'Resultados Gerais'!$B7:$S1048576,7,0)","v":54},null,null,null,57,{"$f":"COUNTIF($E$12:$I$62,M12)","v":7},{"$f":"COUNTIF($E$12:$I$62,M12)","v":7}]
[null,null,{"$f":"COUNT('Resultados Gerais'!B8:B1048576)-1","v":3309},{"$f":"VLOOKUP(C13,'Resultados Gerais'!B:T,2,0)","v":"2013-10-05"},{"$f":"VLOOKUP($C13,'Resultados Gerais'!$B8:$S1048576,3,0)","v":18},{"$f":"VLOOKUP($C13,'Resultados Gerais'!$B8:$S1048576,4,0)","v":27},{"$f":"VLOOKUP($C13,'Resultados Gerais'!$B8:$S1048576,5,0)","v":22},{"$f":"VLOOKUP($C13,'Resultados Gerais'!$B8:$S1048576,6,0)","v":2},{"$f":"VLOOKUP($C13,'Resultados Gerais'!$B8:$S1048576,7,0)","v":68},null,null,null,17,{"$f":"COUNTIF($E$12:$I$62,M13)","v":6},6]
[null,null,{"$f":"COUNT('Resultados Gerais'!B8:B1048576)-2","v":3308},{"$f":"VLOOKUP(C14,'Resultados Gerais'!B:T,2,0)","v":"2013-10-04"},{"$f":"VLOOKUP($C14,'Resultados Gerais'!$B8:$S1048576,3,0)","v":71},{"$f":"VLOOKUP($C14,'Resultados Gerais'!$B8:$S1048576,4,0)","v":32},{"$f":"VLOOKUP($C14,'Resultados Gerais'!$B8:$S1048576,5,0)","v":15},{"$f":"VLOOKUP($C14,'Resultados Gerais'!$B8:$S1048576,6,0)","v":45},{"$f":"VLOOKUP($C14,'Resultados Gerais'!$B8:$S1048576,7,0)","v":17},null,null,null,63,{"$f":"COUNTIF($E$12:$I$62,M14)","v":6},6]
[null,null,{"$f":"COUNT('Resultados Gerais'!B8:B1048576)-3","v":3307},{"$f":"VLOOKUP(C15,'Resultados Gerais'!B:T,2,0)","v":"2013-10-03"},{"$f":"VLOOKUP($C15,'Resultados Gerais'!$B8:$S1048576,3,0)","v":7},{"$f":"VLOOKUP($C15,'Resultados Gerais'!$B8:$S1048576,4,0)","v":59},{"$f":"VLOOKUP($C15,'Resultados Gerais'!$B8:$S1048576,5,0)","v":31},{"$f":"VLOOKUP($C15,'Resultados Gerais'!$B8:$S1048576,6,0)","v":26},{"$f":"VLOOKUP($C15,'Resultados Gerais'!$B8:$S1048576,7,0)","v":76},null,null,null,18,{"$f":"COUNTIF($E$12:$I$62,M15)","v":6},6]
{"$rows_left_out":77}
{"sheet":"100 Últimos Sorteios","index":5,"n_rows":111,"n_cols":15,"rows_kept":111,"cut":false,"hidden":false,"merged":[[1,1,1,16],[2,1,2,16],[3,1,3,16],[8,2,9,8],[8,12,9,13],[5,1,5,16]]}
[]
[null,"Atenção!"]
[null,"Esta planilha é de uso pessoal, é restritamente proibida a distribuição da mesma a terceiros, sujeito a punições de acordo com as leis de direitos autorais"]
[null,"Todos os direitos reservados ao site www.ApostaEsperta.com "]
[]
[null,"Planilha de Análise Estatística Quina"]
[]
[]
[null,null,"Resultados dos Últimos 100 Sorteios",null,null,null,null,null,null,null,null,null,"Números Quentes \nÚltimos 10 Sorteios"]
[]
[null,null,"Sorteio","Data do Sorteio","1ª Dezena","2ª Dezena","3ª Dezena","4ª Dezena","5ª Dezena",null,null,null,"Dezena","Qtd Saídas"]
[null,null,{"$f":"COUNT('Resultados Gerais'!B8:B1048576)","v":3310},{"$f":"VLOOKUP(C12,'Resultados Gerais'!B:T,2,0)","v":"2013-10-07"},{"$f":"VLOOKUP(C12,'Resultados Gerais'!$B7:$S1048576,3,0)","v":19},{"$f":"VLOOKUP($C12,'Resultados Gerais'!$B8:$S1048576,4,0)","v":43},{"$f":"VLOOKUP($C12,'Resultados Gerais'!$B7:$S1048576,5,0)","v":39},{"$f":"VLOOKUP($C12,'Resultados Gerais'!$B7:$S1048576,6,0)","v":17},{"$f":"VLOOKUP($C12,'Resultados Gerais'!$B7:$S1048576,7,0)","v":54},null,null,null,63,{"$f":"COUNTIF($E$12:$I$113,M12)","v":15},{"$f":"COUNTIF($E$12:$I$113,M12)","v":15}]
[null,null,{"$f":"COUNT('Resultados Gerais'!B8:B1048576)-1","v":3309},{"$f":"VLOOKUP(C13,'Resultados Gerais'!B:T,2,0)","v":"2013-10-05"},{"$f":"VLOOKUP($C13,'Resultados Gerais'!$B8:$S1048576,3,0)","v":18},{"$f":"VLOOKUP($C13,'Resultados Gerais'!$B8:$S1048576,4,0)","v":27},{"$f":"VLOOKUP($C13,'Resultados Gerais'!$B8:$S1048576,5,0)","v":22},{"$f":"VLOOKUP($C13,'Resultados Gerais'!$B8:$S1048576,6,0)","v":2},{"$f":"VLOOKUP($C13,'Resultados Gerais'!$B8:$S1048576,7,0)","v":68},null,null,null,59,{"$f":"COUNTIF($E$12:$I$113,M13)","v":11},11]
[null,null,{"$f":"COUNT('Resultados Gerais'!B8:B1048576)-2","v":3308},{"$f":"VLOOKUP(C14,'Resultados Gerais'!B:T,2,0)","v":"2013-10-04"},{"$f":"VLOOKUP($C14,'Resultados Gerais'!$B8:$S1048576,3,0)","v":71},{"$f":"VLOOKUP($C14,'Resultados Gerais'!$B8:$S1048576,4,0)","v":32},{"$f":"VLOOKUP($C14,'Resultados Gerais'!$B8:$S1048576,5,0)","v":15},{"$f":"VLOOKUP($C14,'Resultados Gerais'!$B8:$S1048576,6,0)","v":45},{"$f":"VLOOKUP($C14,'Resultados Gerais'!$B8:$S1048576,7,0)","v":17},null,null,null,17,{"$f":"COUNTIF($E$12:$I$113,M14)","v":10},10]
[null,null,{"$f":"COUNT('Resultados Gerais'!B8:B1048576)-3","v":3307},{"$f":"VLOOKUP(C15,'Resultados Gerais'!B:T,2,0)","v":"2013-10-03"},{"$f":"VLOOKUP($C15,'Resultados Gerais'!$B8:$S1048576,3,0)","v":7},{"$f":"VLOOKUP($C15,'Resultados Gerais'!$B8:$S1048576,4,0)","v":59},{"$f":"VLOOKUP($C15,'Resultados Gerais'!$B8:$S1048576,5,0)","v":31},{"$f":"VLOOKUP($C15,'Resultados Gerais'!$B8:$S1048576,6,0)","v":26},{"$f":"VLOOKUP($C15,'Resultados Gerais'!$B8:$S1048576,7,0)","v":76},null,null,null,34,{"$f":"COUNTIF($E$12:$I$113,M15)","v":9},9]
{"$rows_left_out":96}