{"text_format":"1","workbook":"xlsx","n_sheets":6,"sheets":["Base","Comp_Precos_Ajustados","Precos","Retornos","Cadastro","Dados"],"not_rendered":{"charts":0,"images":1,"macros":1,"external_links":0,"defined_names":8,"comments":1,"pivot_tables":0},"unopened":[],"bounds":{"document_bytes":16777216,"sheet_cells":100000,"rows_first":2000,"rows_last":500,"rows_between":2000,"halvings":0,"cell_chars":16384,"cell_head_chars":4096},"cells_cut":0,"cells_raw":0,"read":"whole","date_system":"1900"}

{"sheet":"Base","index":0,"n_rows":191,"n_cols":12,"rows_kept":191,"cut":false,"hidden":false,"merged":[[6,11,12,12],[2,1,2,3],[2,9,2,10]]}
[]
[]
[null,"Lista de Ativos",null,null,null,null,null,null,null,"Ativo Único"]
[null,"Ticker","Ticker Yahoo","Check",null,"Tipo Preco","Preço",null,null,"Ticker","Ticker Yahoo"]
["Ticker Referencia =>","IBOV",{"$f":"IF(ISTEXT(B5),IFERROR(VLOOKUP(B5,Cadastro!A:B,2,FALSE),\"Ticker Não Cadastrado\"),\"\")","v":"^BVSP"},null,null,"Data Inicial:","2018-12-30",null,null,"IBOV",{"$f":"IF(ISTEXT(J5),IFERROR(VLOOKUP(J5,Cadastro!A:B,2,FALSE),\"Ticker Não Cadastrado\"),\"\")","v":"^BVSP"}]
[null,"USDBRL",{"$f":"IF(ISTEXT(B6),IFERROR(VLOOKUP(B6,Cadastro!A:B,2,FALSE),\"Ticker Não Cadastrado\"),\"\")","v":"USDBRL=X"},null,null,"Data Final:","2019-09-01"]
[null,"ABEV3",{"$f":"IF(ISTEXT(B7),IFERROR(VLOOKUP(B7,Cadastro!A:B,2,FALSE),\"Ticker Não Cadastrado\"),\"\")","v":"ABEV3.SA"},null,null,null,null,null,null,"Fields","Show?","Escolher as Colunas Para Carregar"]
[null,"GGBR4",{"$f":"IF(ISTEXT(B8),IFERROR(VLOOKUP(B8,Cadastro!A:B,2,FALSE),\"Ticker Não Cadastrado\"),\"\")","v":"GGBR4.SA"},null,null,null,null,null,null,"Open","Y"]
[null,"VALE3",{"$f":"IF(ISTEXT(B9),IFERROR(VLOOKUP(B9,Cadastro!A:B,2,FALSE),\"Ticker Não Cadastrado\"),\"\")","v":"VALE3.SA"},null,null,"Tipo Retorno","Linear",null,null,"High","Y"]
[null,"PETR3",{"$f":"IF(ISTEXT(B10),IFERROR(VLOOKUP(B10,Cadastro!A:B,2,FALSE),\"Ticker Não Cadastrado\"),\"\")","v":"PETR3.SA"},null,null,null,null,null,null,"Low","Y"]
[null,null,{"$f":"IF(ISTEXT(B11),IFERROR(VLOOKUP(B11,Cadastro!A:B,2,FALSE),\"Ticker Não Cadastrado\"),\"\")","v":""},null,null,null,null,null,null,"Close","Y"]
[null,null,{"$f":"IF(ISTEXT(B12),IFERROR(VLOOKUP(B12,Cadastro!A:B,2,FALSE),\"Ticker Não Cadastrado\"),\"\")","v":""},null,null,null,null,null,null,"Volume","Y"]
[null,null,{"$f":"IF(ISTEXT(B13),IFERROR(VLOOKUP(B13,Cadastro!A:B,2,FALSE),\"Ticker Não Cadastrado\"),\"\")","v":""},null,null,null,null,null,null,"Adj Close","Y"]
[null,null,{"$f":"IF(ISTEXT(B14),IFERROR(VLOOKUP(B14,Cadastro!A:B,2,FALSE),\"Ticker Não Cadastrado\"),\"\")","v":""}]
[null,null,{"$f":"IF(ISTEXT(B15),IFERROR(VLOOKUP(B15,Cadastro!A:B,2,FALSE),\"Ticker Não Cadastrado\"),\"\")","v":""}]
[null,null,{"$f":"IF(ISTEXT(B16),IFERROR(VLOOKUP(B16,Cadastro!A:B,2,FALSE),\"Ticker Não Cadastrado\"),\"\")","v":""}]
[null,null,{"$f":"IF(ISTEXT(B17),IFERROR(VLOOKUP(B17,Cadastro!A:B,2,FALSE),\"Ticker Não Cadastrado\"),\"\")","v":""}]
[null,null,{"$f":"IF(ISTEXT(B18),IFERROR(VLOOKUP(B18,Cadastro!A:B,2,FALSE),\"Ticker Não Cadastrado\"),\"\")","v":""}]
[null,null,{"$f":"IF(ISTEXT(B19),IFERROR(VLOOKUP(B19,Cadastro!A:B,2,FALSE),\"Ticker Não Cadastrado\"),\"\")","v":""}]
[null,null,{"$f":"IF(ISTEXT(B20),IFERROR(VLOOKUP(B20,Cadastro!A:B,2,FALSE),\"Ticker Não Cadastrado\"),\"\")","v":""}]
[null,null,{"$f":"IF(ISTEXT(B21),IFERROR(VLOOKUP(B21,Cadastro!A:B,2,FALSE),\"Ticker Não Cadastrado\"),\"\")","v":""}]
[null,null,{"$f":"IF(ISTEXT(B22),IFERROR(VLOOKUP(B22,Cadastro!A:B,2,FALSE),\"Ticker Não Cadastrado\"),\"\")","v":""}]
[null,null,{"$f":"IF(ISTEXT(B23),IFERROR(VLOOKUP(B23,Cadastro!A:B,2,FALSE),\"Ticker Não Cadastrado\"),\"\")","v":""}]
[null,null,{"$f":"IF(ISTEXT(B24),IFERROR(VLOOKUP(B24,Cadastro!A:B,2,FALSE),\"Ticker Não Cadastrado\"),\"\")","v":""}]
[null,null,{"$f":"IF(ISTEXT(B25),IFERROR(VLOOKUP(B25,Cadastro!A:B,2,FALSE),\"Ticker Não Cadastrado\"),\"\")","v":""}]
[null,null,{"$f":"IF(ISTEXT(B26),IFERROR(VLOOKUP(B26,Cadastro!A:B,2,FALSE),\"Ticker Não Cadastrado\"),\"\")","v":""}]
[null,null,{"$f":"IF(ISTEXT(B27),IFERROR(VLOOKUP(B27,Cadastro!A:B,2,FALSE),\"Ticker Não Cadastrado\"),\"\")","v":""}]
[null,null,{"$f":"IF(ISTEXT(B28),IFERROR(VLOOKUP(B28,Cadastro!A:B,2,FALSE),\"Ticker Não Cadastrado\"),\"\")","v":""}]
[null,null,{"$f":"IF(ISTEXT(B29),IFERROR(VLOOKUP(B29,Cadastro!A:B,2,FALSE),\"Ticker Não Cadastrado\"),\"\")","v":""}]
[null,null,{"$f":"IF(ISTEXT(B30),IFERROR(VLOOKUP(B30,Cadastro!A:B,2,FALSE),\"Ticker Não Cadastrado\"),\"\")","v":""}]
[null,null,{"$f":"IF(ISTEXT(B31),IFERROR(VLOOKUP(B31,Cadastro!A:B,2,FALSE),\"Ticker Não Cadastrado\"),\"\")","v":""}]
[null,null,{"$f":"IF(ISTEXT(B32),IFERROR(VLOOKUP(B32,Cadastro!A:B,2,FALSE),\"Ticker Não Cadastrado\"),\"\")","v":""}]
[null,null,{"$f":"IF(ISTEXT(B33),IFERROR(VLOOKUP(B33,Cadastro!A:B,2,FALSE),\"Ticker Não Cadastrado\"),\"\")","v":""}]
[null,null,{"$f":"IF(ISTEXT(B34),IFERROR(VLOOKUP(B34,Cadastro!A:B,2,FALSE),\"Ticker Não Cadastrado\"),\"\")","v":""}]
[null,null,{"$f":"IF(ISTEXT(B35),IFERROR(VLOOKUP(B35,Cadastro!A:B,2,FALSE),\"Ticker Não Cadastrado\"),\"\")","v":""}]
[null,null,{"$f":"IF(ISTEXT(B36),IFERROR(VLOOKUP(B36,Cadastro!A:B,2,FALSE),\"Ticker Não Cadastrado\"),\"\")","v":""}]
[null,null,{"$f":"IF(ISTEXT(B37),IFERROR(VLOOKUP(B37,Cadastro!A:B,2,FALSE),\"Ticker Não Cadastrado\"),\"\")","v":""}]
[null,null,{"$f":"IF(ISTEXT(B38),IFERROR(VLOOKUP(B38,Cadastro!A:B,2,FALSE),\"Ticker Não Cadastrado\"),\"\")","v":""}]
[null,null,{"$f":"IF(ISTEXT(B39),IFERROR(VLOOKUP(B39,Cadastro!A:B,2,FALSE),\"Ticker Não Cadastrado\"),\"\")","v":""}]
[null,null,{"$f":"IF(ISTEXT(B40),IFERROR(VLOOKUP(B40,Cadastro!A:B,2,FALSE),\"Ticker Não Cadastrado\"),\"\")","v":""}]
{"$rows_left_out":152}
{"sheet":"Comp_Precos_Ajustados","index":1,"n_rows":413,"n_cols":9,"rows_kept":413,"cut":false,"hidden":true,"merged":[[1,5,11,8]]}
[]
["ABEV3","Preço Ajustado Yahoo","Correto","Diferença",null,"Comparacao da rentabilidade pelo preco ajustado do Yahoo Finance contra o preco ajustado da Bloomberg (correto), ate 22 de agosto de 2019"]
[2015,0.14070175522492789,0.13649103139013485,4.2107238347930398E-3]
[2016,-4.7741570751251849E-2,-4.7718865598027738E-2,-2.2705153224111818E-5]
[2017,0.33412891891883323,0.33413181406189163,-2.8951430584012172E-6]
[2018,-0.25365319292307875,-0.25365167176202219,-1.5211610565613043E-6]
[2019,0.20091020806241833,0.19180754226267882,9.1026657997395066E-3]
[]
["B3SA3","Preço Ajustado Yahoo","Correto","Diferença"]
[2015,0.184215443641502,0.18295889101338569,1.2565526281163031E-3]
[2016,0.56271545347346552,0.56278411960804275,-6.8666134577233251E-5]
[2017,0.4095659874851314,0.40950226244343746,6.3725041693940554E-5]
[2018,0.21304577366124899,0.21307039669800498,-2.4623036755988537E-5]
[2019,0.7190292985419271,0.65702619938754436,6.2003099154382735E-2]
[]
["BBAS3","Preço Ajustado Yahoo","Correto","Diferença"]
[2015,-0.31491748428253996,-0.31490215211145456,-1.5332171085402635E-5]
[2016,0.99411065715893643,0.99406551669568022,4.5140463256210239E-5]
[2017,0.16848483354470534,0.16848537756438442,-5.4401967908290771E-7]
[2018,0.49988809254658451,0.52409413522600112,-2.4206042679416617E-2]
[2019,1.3215599561695379E-2,1.5597147950090484E-3,1.1655884766686331E-2]
[]
["BBDC3","Preço Ajustado Yahoo","Correto","Diferença",null,"BBDC3","Preço Nao Ajustado Yahoo","Correto","Diferença"]
[2015,-0.21532177706974431,-0.2451182939020331,2.9796516832288789E-2,null,2015,-0.2795558494087047,-0.2451182939020331,-3.4437555506671602E-2]
[2016,0.62003432188713714,0.63458991789529406,-1.4555596008156924E-2,null,2016,0.56360724581223254,0.63458991789529406,-7.0982672083061527E-2]
[2017,0.23157354313734935,0.25606265190386246,-2.4489108766513112E-2,null,2017,0.21022588234661055,0.25606265190386246,-4.5836769557251911E-2]
[2018,0.18129983506708491,0.20179738562091498,-2.0497550553830068E-2,null,2018,0.16141366024178194,0.20179738562091498,-4.038372537913304E-2]
[2019,7.4848068427937342E-3,7.1916705427736982E-3,2.9313630002003599E-4,null,2019,-2.0667675825909448E-3,7.1916705427736982E-3,-9.2584381253646431E-3]
[]
["BBDC4","Preço Ajustado Yahoo","Correto","Diferença"]
[2015,-0.27087346152505332,-0.29878290779203553,2.7909446266982219E-2]
[2016,0.72228217109659898,0.7370059428355813,-1.4723771738982316E-2]
[2017,0.35193108551888819,0.3345823829694794,1.734870254940879E-2]
[2018,0.30792647650424221,0.2988402848423195,9.0861916619227046E-3]
[2019,1.8589388210776825E-3,1.597794417117937E-3,2.6114440395974547E-4]
[]
["BBSE3","Preço Ajustado Yahoo","Correto","Diferença"]
[2015,-0.19329343785139497,-0.20013111888111934,6.837681029724374E-3]
[2016,0.23721450020302481,0.23725479481995504,-4.0294616930225402E-5]
[2017,6.8952871460955079E-2,6.8939628141149178E-2,1.32433198059001E-5]
{"$rows_left_out":374}
{"sheet":"Precos","index":2,"n_rows":167,"n_cols":7,"rows_kept":167,"cut":false,"hidden":true,"merged":[]}
["Data","IBOV","USDBRL","ABEV3","GGBR4","VALE3","PETR3"]
["2019-01-02",91012,3.8799000000000001,16.149999999999999,14.939016000000001,51.09,26.366747]
["2019-01-03",91564,3.7863000000000002,16.329999999999998,14.840733999999999,49,26.910902]
["2019-01-04",91841,3.7551000000000001,16.549999,15.233866000000001,52.189999,27.217607000000001]
["2019-01-07",91699,3.6612,16.48,15.273179000000001,51.91,28.098147999999998]
["2019-01-08",92032,3.7341000000000002,16.149999999999999,15.292835999999999,52.41,27.949741]
["2019-01-09",93613,3.7124000000000001,16.379999000000002,15.725281000000001,53.689999,28.513683]
["2019-01-10",93806,3.68,16.850000000000001,15.322321000000001,53.099997999999999,28.375171999999999]
["2019-01-11",93658,3.7079,17.290001,14.958674,52.380001,28.197084]
["2019-01-14",94474,3.6596000000000002,17.540001,14.939016000000001,52.599997999999999,28.098147999999998]
["2019-01-15",94056,3.6974999999999998,17.700001,14.644166999999999,52.349997999999999,28.009101999999999]
["2019-01-16",94393,3.7164000000000001,17.799999,14.673654000000001,52.650002000000001,28.236660000000001]
["2019-01-17",95351,3.7343000000000002,17.850000000000001,14.791594,54.23,28.47411]
["2019-01-18",96097,3.7488999999999999,18,15.224038,54.759998000000003,28.840176]
["2019-01-21",96010,3.7502,18,15.233866000000001,55.279998999999997,28.978687000000001]
["2019-01-22",95103,3.7513999999999998,17.540001,15.204382000000001,55.080002,28.543364]
["2019-01-23",96558,3.8119999999999998,17.18,15.38129,55.650002000000001,28.840176]
["2019-01-24",97677,3.7623000000000002,17.16,15.715453,56.150002000000001,29.146878999999998]
["2019-01-28",95444,3.7696000000000001,17.950001,15.371463,42.360000999999997,28.117934999999999]
["2019-01-29",95639,3.7595999999999998,17.870000999999998,15.371463,42.740001999999997,28.731344]
["2019-01-30",96996,3.7185000000000001,17.969999000000001,15.872705,46.599997999999999,29.127094]
["2019-01-31",97394,3.6814,17.510000000000002,15.38129,45.5,29.235924000000001]
["2019-02-01",97861,3.6427999999999998,18.110001,15.528715,46.25,29.700928000000001]
["2019-02-04",98589,3.6573000000000002,18.450001,15.715453,44.68,30.037317000000002]
["2019-02-05",98311,3.6669999999999998,18.639999,15.646655000000001,44.52,30.225296]
["2019-02-06",94636,3.6682999999999999,18.09,15.066784999999999,42.459999000000003,29.691036]
["2019-02-07",94406,3.6947000000000001,18.75,14.968502000000001,41.59,29.166668000000001]
["2019-02-08",95343,3.7149000000000001,18.219999000000001,15.086442999999999,43.16,28.9589]
["2019-02-11",94413,3.7286000000000001,18.709999,15.184725,42.02,28.592832999999999]
["2019-02-12",96168,3.7551999999999999,18.670000000000002,15.233866000000001,44.299999,29.621780000000001]
["2019-02-13",95842,3.7080000000000002,18.389999,15.361634,45.490001999999997,30.324234000000001]
["2019-02-14",98015,3.7532000000000001,18.59,15.459917000000001,45.66,30.957432000000001]
["2019-02-15",97526,3.722,18.489999999999998,15.21421,45.880001,30.71998]
["2019-02-18",96510,3.6467999999999998,18.190000999999999,15.283008000000001,45.25,30.363807999999999]
["2019-02-19",97659,3.7317,18.32,15.273179000000001,45.490001999999997,30.92775]
["2019-02-20",96545,3.722,18.149999999999999,15.528715,45.799999,30.92775]
["2019-02-21",96932,3.7240000000000002,18.32,14.840733999999999,45.380001,31.095942999999998]
["2019-02-22",97886,3.7665000000000002,18.32,14.919361,46.990001999999997,30.917853999999998]
["2019-02-25",97240,3.7463000000000002,18.389999,15.007816,47.119999,30.175827000000002]
["2019-02-26",97603,3.7504,18.489999999999998,15.21421,47.200001,30.18572]
{"$rows_left_out":128}
{"sheet":"Retornos","index":3,"n_rows":166,"n_cols":7,"rows_kept":166,"cut":false,"hidden":true,"merged":[]}
["Data","IBOV","USDBRL","ABEV3","GGBR4","VALE3","PETR3"]
["2019-01-03",6.0651342680086984E-3,-2.4124333101368522E-2,1.1145510835913308E-2,-6.5788804296079695E-3,-4.090820121354477E-2,2.0637927007074452E-2]
["2019-01-04",3.0252064130007472E-3,-8.2402345297519775E-3,1.3472075933864236E-2,2.6490064440209071E-2,6.5102020408163375E-2,1.1397053878015706E-2]
["2019-01-07",-1.5461504121253578E-3,-2.5005991851082543E-2,-4.229547083356322E-3,2.5806318632446423E-3,-5.3649933965318475E-3,3.2351888981275945E-2]
["2019-01-08",3.6314463625557458E-3,1.9911504424778848E-2,-2.0024271844660269E-2,1.287027409290431E-3,9.6320554806395009E-3,-5.2817360062307195E-3]
["2019-01-09",1.7178807371349025E-2,-5.8113066066789454E-3,1.4241424148607074E-2,2.827761966452802E-2,2.4422800992177196E-2,2.0177002713549275E-2]
["2019-01-10",2.0616794675953898E-3,-8.7275078116582083E-3,2.8693591495335236E-2,-2.5624979292897865E-2,-1.0989029819128859E-2,-4.8577028790002252E-3]
["2019-01-11",-1.5777242393876234E-3,7.5815217391304035E-3,2.6112818991097742E-2,-2.3733153743483171E-2,-1.3559266047429963E-2,-6.2761910306657898E-3]
["2019-01-14",8.7125499156506248E-3,-1.3026241268642602E-2,1.4459224149264038E-2,-1.3141539149793546E-3,4.2000190110724755E-3,-3.5087316121057421E-3]
["2019-01-15",-4.4244977454114265E-3,1.0356323095420228E-2,9.1220063214363378E-3,-1.9736842105263275E-2,-4.7528518917434592E-3,-3.1691056649000293E-3]
["2019-01-16",3.582971846559424E-3,5.1115618661259354E-3,5.6496042005873548E-3,2.0135662205984506E-3,5.7307356535143406E-3,8.1244304083722962E-3]
["2019-01-17",1.0149057663174199E-2,4.8164890754494039E-3,2.8090451016318241E-3,8.0375344818679473E-3,3.0009457549498242E-2,8.4092807010460735E-3]
["2019-01-18",7.8237249740433779E-3,3.9097019521729948E-3,8.4033613445377853E-3,2.9235794330212173E-2,9.7731513922183488E-3,1.2856099804348542E-2]
["2019-01-21",-9.0533523419045192E-4,3.4676838539304811E-4,0,6.4555803131871592E-4,9.4960010772826564E-3,4.8027099418532782E-3]
["2019-01-22",-9.4469326111863428E-3,3.1998293424351232E-4,-2.5555499999999953E-2,-1.9354246650193918E-3,-3.6178908035073842E-3,-1.5022178195996272E-2]
["2019-01-23",1.5299201917920557E-2,1.615396918483758E-2,-2.0524571235771338E-2,1.1635329867402566E-2,1.0348583502230113E-2,1.0398634162392284E-2]
["2019-01-24",1.1588889579320139E-2,-1.3037775445960076E-2,-1.1641443538998875E-3,2.1725290921632778E-2,8.9847256429569367E-3,1.0634574490807402E-2]
["2019-01-28",-2.2861062481443928E-2,1.9403024745501263E-3,4.6037354312354228E-2,-2.1888646798790989E-2,-0.24559217290856028,-3.5302030107580262E-2]
["2019-01-29",2.0430828548678726E-3,-2.6528013582343135E-3,-4.4568242642438749E-3,0,8.9707504964411378E-3,2.1815577850933909E-2]
["2019-01-30",1.4188772362738966E-2,-1.09320140440472E-2,5.5958586683908518E-3,3.2608607261390699E-2,9.0313425815937043E-2,1.3774155500696272E-2]
["2019-01-31",4.1032619901850698E-3,-9.9771413204249315E-3,-2.5598165030504494E-2,-3.0959751346730124E-2,-2.3605108309232126E-2,3.7363837257504695E-3]
["2019-02-01",4.7949565681664197E-3,-1.0485141522246999E-2,3.4266190748143854E-2,9.5846967321986387E-3,1.6483516483516425E-2,1.5905226734068689E-2]
["2019-02-04",7.4391228374939278E-3,3.9804545953663339E-3,1.8774156887125582E-2,1.2025335000352522E-2,-3.394594594594591E-2,1.1325875070300917E-2]
["2019-02-05",-2.8197871973546507E-3,2.6522297870013034E-3,1.0297994021788881E-2,-4.3777293597581091E-3,-3.5810205908682891E-3,6.2581821139351401E-3]
["2019-02-06",-3.7381371362309457E-2,3.5451322607027436E-4,-2.9506385703132243E-2,-3.7060317364957629E-2,-4.627136118598385E-2,-1.76759228429062E-2]
["2019-02-07",-2.4303647660509631E-3,7.1967941553308101E-3,3.6484245439469376E-2,-6.5231567318441153E-3,-2.0489849752469369E-2,-1.7660818571638925E-2]
["2019-02-08",9.9252166175878287E-3,5.4672909843831441E-3,-2.8266719999999967E-2,7.8792787681758458E-3,3.7749459004568164E-2,-7.1234739600698482E-3]
["2019-02-11",-9.7542556873603248E-3,3.6878516245391069E-3,2.6893525076483238E-2,6.5145906162242806E-3,-2.6413345690453949E-2,-1.2640915228133709E-2]
["2019-02-12",1.8588541832162964E-2,7.1340449498471514E-3,-2.1378408411458771E-3,3.2362127071778879E-3,5.4259852451213675E-2,3.5986185769000256E-2]
["2019-02-13",-3.3899010065718826E-3,-1.2569237324243643E-2,-1.4997375468666418E-2,8.3871027879593996E-3,2.6862370809534353E-2,2.371410495925641E-2]
["2019-02-14",2.2672732205087476E-2,1.2189859762675281E-2,1.0875530770828146E-2,6.3979521970123354E-3,3.7370409436341401E-3,2.0880923158685505E-2]
["2019-02-15",-4.9890322909759144E-3,-8.3129063199403053E-3,-5.3792361484670259E-3,-1.5893164238850788E-2,4.8182435392027934E-3,-7.6702744594577821E-3]
["2019-02-18",-1.0417734757910746E-2,-2.0204191295002727E-2,-1.6224932395889624E-2,4.5219567759351431E-3,-1.373149490559078E-2,-1.1594148173273533E-2]
["2019-02-19",1.1905502020516101E-2,2.3280684435669663E-2,7.1467285790693946E-3,-6.4313255610415343E-4,5.3039116022097765E-3,1.857283513319552E-2]
["2019-02-20",-1.1407038777788037E-2,-2.5993515019964164E-3,-9.2794759825328699E-3,1.6731028949506843E-2,6.8146182978845449E-3,0]
["2019-02-21",4.0084934486508406E-3,5.3734551316497736E-4,9.366391184573164E-3,-4.4303794615330405E-2,-9.1702622089576691E-3,5.4382552885352542E-3]
["2019-02-22",9.8419510584739633E-3,1.141245972073035E-2,0,5.2980533173090372E-3,3.5478205476460856E-2,-5.7270815038475975E-3]
["2019-02-25",-6.5995137200416387E-3,-5.3630691623522964E-3,3.8209061135370259E-3,5.928873227211362E-3,2.7664821125141792E-3,-2.3999951613717929E-2]
["2019-02-26",3.7330316742081315E-3,1.094413154312246E-3,5.4377925741049271E-3,1.3752434065023245E-2,1.6978353501237997E-3,3.278451987414055E-4]
["2019-02-27",-3.0326936672028237E-3,-8.7990614334465533E-4,-7.0307733910220938E-3,-3.2299409565136328E-3,-7.838961698327096E-3,5.244234691105687E-3]
{"$rows_left_out":127}
{"sheet":"Cadastro","index":4,"n_rows":67,"n_cols":2,"rows_kept":67,"cut":false,"hidden":false,"merged":[]}
["Ticker","Ticker Yahoo"]
["IBOV","^BVSP"]
["USDBRL","USDBRL=X"]
["ABEV3",{"$f":"A4 & \".SA\"","v":"ABEV3.SA"}]
["AZUL4",{"$f":"A5 & \".SA\"","v":"AZUL4.SA"}]
["B3SA3","B3SA3.SA"]
["BBAS3","BBAS3.SA"]
["BBDC3","BBDC3.SA"]
["BBDC4","BBDC4.SA"]
["BBSE3","BBSE3.SA"]
["BRAP4","BRAP4.SA"]
["BRDT3","BRDT3.SA"]
["BRFS3","BRFS3.SA"]
["BRKM5","BRKM5.SA"]
["BRML3","BRML3.SA"]
["BTOW3","BTOW3.SA"]
["CCRO3","CCRO3.SA"]
["CIEL3","CIEL3.SA"]
["CMIG4","CMIG4.SA"]
["CSAN3","CSAN3.SA"]
["CSNA3","CSNA3.SA"]
["CVCB3","CVCB3.SA"]
["CYRE3","CYRE3.SA"]
["ECOR3","ECOR3.SA"]
["EGIE3","EGIE3.SA"]
["ELET3","ELET3.SA"]
["ELET6","ELET6.SA"]
["EMBR3","EMBR3.SA"]
["ENBR3","ENBR3.SA"]
["EQTL3","EQTL3.SA"]
["FLRY3","FLRY3.SA"]
["GGBR4","GGBR4.SA"]
["GOAU4","GOAU4.SA"]
["GOLL4","GOLL4.SA"]
["HYPE3","HYPE3.SA"]
["IGTA3","IGTA3.SA"]
["IRBR3","IRBR3.SA"]
["ITSA4","ITSA4.SA"]
["ITUB4","ITUB4.SA"]
["JBSS3","JBSS3.SA"]
{"$rows_left_out":28}
{"sheet":"Dados","index":5,"n_rows":167,"n_cols":7,"rows_kept":167,"cut":false,"hidden":true,"merged":[]}
["Date","Open","High","Low","Close","Adj Close","Volume"]
["2019-01-02",25.41,26.950001,25.1,26.65,26.366747,14725300]
["2019-01-03",26.65,27.43,26.280000999999999,27.200001,26.910902,12766200]
["2019-01-04",27.24,27.559999000000001,27.07,27.51,27.217607000000001,10848500]
["2019-01-07",27.559999000000001,29.1,27.549999,28.4,28.098147999999998,16164400]
["2019-01-08",28.65,28.77,28.110001,28.25,27.949741,12562900]
["2019-01-09",28.51,28.98,28.51,28.82,28.513683,9306000]
["2019-01-10",28.73,28.780000999999999,28.35,28.68,28.375171999999999,7677100]
["2019-01-11",28.59,28.59,28.25,28.5,28.197084,6481900]
["2019-01-14",28.280000999999999,28.700001,28.110001,28.4,28.098147999999998,6240300]
["2019-01-15",28.35,28.700001,28.16,28.309999000000001,28.009101999999999,6349600]
["2019-01-16",28.299999,28.540001,28.09,28.540001,28.236660000000001,6432700]
["2019-01-17",28.4,29,28.25,28.780000999999999,28.47411,6419300]
["2019-01-18",28.99,29.299999,28.85,29.15,28.840176,8168500]
["2019-01-21",28.93,29.299999,28.73,29.290001,28.978687000000001,3904200]
["2019-01-22",29.17,29.200001,28.67,28.85,28.543364,6692600]
["2019-01-23",29,29.370000999999998,28.889999,29.15,28.840176,6083000]
["2019-01-24",29.15,29.459999,28.969999000000001,29.459999,29.146878999999998,7013000]
["2019-01-28",29.42,29.719999000000001,28.32,28.42,28.117934999999999,17030300]
["2019-01-29",28.709999,29.4,28.709999,29.040001,28.731344,7315000]
["2019-01-30",29.4,29.700001,29.25,29.440000999999999,29.127094,8684300]
["2019-01-31",29.700001,29.969999000000001,29.530000999999999,29.549999,29.235924000000001,12127100]
["2019-02-01",29.469999000000001,30.049999,29.299999,30.02,29.700928000000001,7368400]
["2019-02-04",29.809999000000001,30.52,29.77,30.360001,30.037317000000002,10513600]
["2019-02-05",30.360001,30.719999000000001,30.1,30.549999,30.225296,5306500]
["2019-02-06",30.26,30.48,29.93,30.01,29.691036,8922400]
["2019-02-07",30.120000999999998,30.59,29.17,29.48,29.166668000000001,9480800]
["2019-02-08",29.16,29.6,28.879999000000002,29.27,28.9589,8255700]
["2019-02-11",29.25,29.280000999999999,28.76,28.9,28.592832999999999,4533600]
["2019-02-12",29.5,30.040001,29.5,29.940000999999999,29.621780000000001,9929300]
["2019-02-13",30.23,30.82,30.049999,30.65,30.324234000000001,11301000]
["2019-02-14",30.67,31.34,30.559999000000001,31.290001,30.957432000000001,8430200]
["2019-02-15",31.1,31.440000999999999,30.889999,31.049999,30.71998,6468200]
["2019-02-18",30.809999000000001,30.98,30.59,30.690000999999999,30.363807999999999,4272700]
["2019-02-19",30.860001,31.5,30.780000999999999,31.26,30.92775,7505000]
["2019-02-20",31.35,31.74,30.870000999999998,31.26,30.92775,11134900]
["2019-02-21",31.450001,31.610001,31,31.43,31.095942999999998,6083800]
["2019-02-22",31.700001,31.790001,30.98,31.25,30.917853999999998,7140300]
["2019-02-25",31.110001,31.200001,30.450001,30.5,30.175827000000002,8856200]
["2019-02-26",30.549999,31.09,30.35,30.51,30.18572,7813200]
{"$rows_left_out":127}