{"text_format":"1","workbook":"xlsx","n_sheets":6,"sheets":["Resultados Gerais","Total de Saída de Cada Dezena","10 Últimos Sorteios","20 Últimos Sorteios","50 Últimos Sorteios","100 Últimos Sorteios"],"not_rendered":{"charts":1,"images":3,"macros":1,"external_links":0,"defined_names":6,"comments":0,"pivot_tables":0},"unopened":[],"bounds":{"document_bytes":16777216,"sheet_cells":100000,"rows_first":2000,"rows_last":500,"rows_between":2000,"halvings":0,"cell_chars":16384,"cell_head_chars":4096},"cells_cut":0,"cells_raw":0,"read":"whole","date_system":"1900"}

{"sheet":"Resultados Gerais","index":0,"n_rows":1514,"n_cols":20,"rows_kept":1514,"cut":false,"hidden":false,"merged":[[1,1,1,12],[2,1,2,12],[3,1,3,12],[5,1,5,13]]}
[]
[null,"Atenção!"]
[null,"Esta planilha é de uso pessoal, é restritamente proibida a distribuição da mesma a terceiros, sujeito a punições de acordo com as leis de direitos autorais"]
[null,"Todos os direitos reservados ao site www.ApostaEsperta.com "]
[]
[null,"Planilha de Análise Estatística Mega Sena"]
[null,"Concurso","Data Sorteio","1ª Dezena","2ª Dezena","3ª Dezena","4ª Dezena","5ª Dezena","6ª Dezena","Arrecadacao_Total","Ganhadores_Sena","Rateio_Sena","Ganhadores_Quina","Rateio_Quina","Ganhadores_Quadra","Rateio_Quadra","Acumulado","Valor_Acumulado","Estimativa_Prêmio","Acumulado_Mega_da_Virada"]
[null,1,"1996-03-11",41,5,4,52,30,33,0,0,0,17,39158.92,2016,330.21,"SIM",1714650.23,0,0]
[null,2,"1996-03-18",9,39,37,49,43,41,0,1,2307162.23,65,14424.02,4488,208.91,"NÃO",0,0,0]
[null,3,"1996-03-25",36,30,10,11,29,47,0,2,391192.51,62,10515.93,4261,153.01,"NÃO",0,0,0]
[null,4,"1996-04-01",6,59,42,27,1,5,0,0,0,39,15322.24,3311,180.48,"SIM",717080.75,0,0]
[null,5,"1996-04-08",1,19,46,6,16,2,0,0,0,98,5318.1,5399,96.53,"SIM",1342488.85,0,0]
[null,6,"1996-04-15",19,40,7,13,22,47,0,0,0,109,7214.66,7147,110.03,"SIM",2286166.33,0,0]
[null,7,"1996-04-22",56,38,21,20,3,5,0,0,0,100,8746.0499999999993,5736,152.47999999999999,"SIM",3335692.28,0,0]
[null,8,"1996-04-29",53,17,38,4,47,37,0,0,0,60,16084.11,5262,183.4,"SIM",4493748.1900000004,0,0]
{"$rows_left_out":1500}
{"sheet":"Total de Saída de Cada Dezena","index":1,"n_rows":67,"n_cols":3,"rows_kept":67,"cut":false,"hidden":false,"merged":[[5,1,5,20],[1,1,1,19],[2,1,2,19],[3,1,3,19]]}
[]
[null,"Atenção!"]
[null,"Esta planilha é de uso pessoal, é restritamente proibida a distribuição da mesma a terceiros, sujeito a punições de acordo com as leis de direitos autorais"]
[null,"Todos os direitos reservados ao site www.ApostaEsperta.com "]
[]
[null,"Planilha de Análise Estatística Mega Sena"]
[null,"Dezena","Total de Saída"]
[null,1,{"$f":"COUNTIF('Resultados Gerais'!$D8:$I1048576,B8)","v":143}]
[null,2,{"$f":"COUNTIF('Resultados Gerais'!$D8:$I1048576,B9)","v":153}]
[null,3,{"$f":"COUNTIF('Resultados Gerais'!$D8:$I1048576,B10)","v":149}]
[null,4,{"$f":"COUNTIF('Resultados Gerais'!$D8:$I1048576,B11)","v":172}]
[null,5,{"$f":"COUNTIF('Resultados Gerais'!$D8:$I1048576,B12)","v":179}]
[null,6,{"$f":"COUNTIF('Resultados Gerais'!$D8:$I1048576,B13)","v":147}]
[null,7,{"$f":"COUNTIF('Resultados Gerais'!$D8:$I1048576,B14)","v":149}]
[null,8,{"$f":"COUNTIF('Resultados Gerais'!$D8:$I1048576,B15)","v":152}]
{"$rows_left_out":53}
{"sheet":"10 Últimos Sorteios","index":2,"n_rows":71,"n_cols":16,"rows_kept":71,"cut":false,"hidden":false,"merged":[[8,13,9,14],[8,2,9,9],[1,1,1,17],[2,1,2,17],[3,1,3,17],[5,1,5,17]]}
[]
[null,"Atenção!"]
[null,"Esta planilha é de uso pessoal, é restritamente proibida a distribuição da mesma a terceiros, sujeito a punições de acordo com as leis de direitos autorais"]
[null,"Todos os direitos reservados ao site www.ApostaEsperta.com "]
[]
[null,"Planilha de Análise Estatística Mega Sena"]
[]
[]
[null,null,"Resultados dos Últimos 10 Sorteios",null,null,null,null,null,null,null,null,null,null,"Números Quentes Últimos 10 Sorteios"]
[]
[null,null,"Sorteio","Data do Sorteio","1ª Dezena","2ª Dezena","3ª Dezena","4ª Dezena","5ª Dezena","6ª Dezena",null,null,null,"Dezenas","Qtd de Saída"]
[null,null,{"$f":"COUNT('Resultados Gerais'!$B8:$B1048576)","v":1507},{"$f":"VLOOKUP(C12,'Resultados Gerais'!$B8:$C1048576,2,0)","v":"2013-06-29"},{"$f":"VLOOKUP(C12,'Resultados Gerais'!$B8:$I1048576,3,0)","v":46},{"$f":"VLOOKUP(C12,'Resultados Gerais'!$B8:$I1048576,4,0)","v":24},{"$f":"VLOOKUP(C12,'Resultados Gerais'!$B8:$I1048576,5,0)","v":51},{"$f":"VLOOKUP(C12,'Resultados Gerais'!$B8:$I1048576,6,0)","v":50},{"$f":"VLOOKUP(C12,'Resultados Gerais'!$B8:$I1048576,7,0)","v":56},{"$f":"VLOOKUP(C12,'Resultados Gerais'!$B8:$I1048576,8,0)","v":52},null,null,null,22,{"$f":"COUNTIF($E$12:$J$22,N12)","v":3},{"$f":"O12","v":3}]
[null,null,{"$f":"COUNT('Resultados Gerais'!$B8:$B1048576) -1","v":1506},{"$f":"VLOOKUP(C13,'Resultados Gerais'!B8:$C1048576,2,0)","v":"2013-06-26"},{"$f":"VLOOKUP(C13,'Resultados Gerais'!$B8:$I1048576,3,0)","v":49},{"$f":"VLOOKUP(C13,'Resultados Gerais'!$B8:$I1048576,4,0)","v":34},{"$f":"VLOOKUP(C13,'Resultados Gerais'!$B8:$I1048576,5,0)","v":42},{"$f":"VLOOKUP(C13,'Resultados Gerais'!$B8:$I1048576,6,0)","v":18},{"$f":"VLOOKUP(C13,'Resultados Gerais'!$B8:$I1048576,7,0)","v":3},{"$f":"VLOOKUP(C13,'Resultados Gerais'!$B8:$I1048576,8,0)","v":14},null,null,null,6,{"$f":"COUNTIF($E$12:$J$22,N13)","v":3},{"$f":"O13","v":3}]
[null,null,{"$f":"COUNT('Resultados Gerais'!$B8:$B1048576)-2","v":1505},{"$f":"VLOOKUP(C14,'Resultados Gerais'!B8:$C1048576,2,0)","v":"2013-06-22"},{"$f":"VLOOKUP(C14,'Resultados Gerais'!$B8:$I1048576,3,0)","v":32},{"$f":"VLOOKUP(C14,'Resultados Gerais'!$B8:$I1048576,4,0)","v":1},{"$f":"VLOOKUP(C14,'Resultados Gerais'!$B8:$I1048576,5,0)","v":6},{"$f":"VLOOKUP(C14,'Resultados Gerais'!$B8:$I1048576,6,0)","v":9},{"$f":"VLOOKUP(C14,'Resultados Gerais'!$B8:$I1048576,7,0)","v":16},{"$f":"VLOOKUP(C14,'Resultados Gerais'!$B8:$I1048576,8,0)","v":2},null,null,null,42,{"$f":"COUNTIF($E$12:$J$22,N14)","v":3},3]
[null,null,{"$f":"COUNT('Resultados Gerais'!$B8:$B1048576)-3","v":1504},{"$f":"VLOOKUP(C15,'Resultados Gerais'!B8:$C1048576,2,0)","v":"2013-06-19"},{"$f":"VLOOKUP(C15,'Resultados Gerais'!$B8:$I1048576,3,0)","v":41},{"$f":"VLOOKUP(C15,'Resultados Gerais'!$B8:$I1048576,4,0)","v":2},{"$f":"VLOOKUP(C15,'Resultados Gerais'!$B8:$I1048576,5,0)","v":42},{"$f":"VLOOKUP(C15,'Resultados Gerais'!$B8:$I1048576,6,0)","v":30},{"$f":"VLOOKUP(C15,'Resultados Gerais'!$B8:$I1048576,7,0)","v":12},{"$f":"VLOOKUP(C15,'Resultados Gerais'!$B8:$I1048576,8,0)","v":10},null,null,null,49,{"$f":"COUNTIF($E$12:$J$22,N15)","v":2},2]
{"$rows_left_out":57}
{"sheet":"20 Últimos Sorteios","index":3,"n_rows":71,"n_cols":16,"rows_kept":71,"cut":false,"hidden":false,"merged":[[8,13,9,14],[8,2,9,9],[5,1,5,17],[1,1,1,17],[2,1,2,17],[3,1,3,17]]}
[]
[null,"Atenção!"]
[null,"Esta planilha é de uso pessoal, é restritamente proibida a distribuição da mesma a terceiros, sujeito a punições de acordo com as leis de direitos autorais"]
[null,"Todos os direitos reservados ao site www.ApostaEsperta.com "]
[]
[null,"Planilha de Análise Estatística Mega Sena"]
[]
[]
[null,null,"Resultados dos Últimos 20 Sorteios",null,null,null,null,null,null,null,null,null,null,"Números Quentes Últimos 20 Sorteios"]
[]
[null,null,"Sorteio","Data do Sorteio","1ª Dezena","2ª Dezena","3ª Dezena","4ª Dezena","5ª Dezena","6ª Dezena",null,null,null,"Dezenas","Qtd de Saída"]
[null,null,{"$f":"COUNT('Resultados Gerais'!$B8:$B1048576)","v":1507},{"$f":"VLOOKUP(C12,'Resultados Gerais'!$B8:$C1048576,2,0)","v":"2013-06-29"},{"$f":"VLOOKUP(C12,'Resultados Gerais'!$B8:$I1048576,3,0)","v":46},{"$f":"VLOOKUP(C12,'Resultados Gerais'!$B8:$I1048576,4,0)","v":24},{"$f":"VLOOKUP(C12,'Resultados Gerais'!$B8:$I1048576,5,0)","v":51},{"$f":"VLOOKUP(C12,'Resultados Gerais'!$B8:$I1048576,6,0)","v":50},{"$f":"VLOOKUP(C12,'Resultados Gerais'!$B8:$I1048576,7,0)","v":56},{"$f":"VLOOKUP(C12,'Resultados Gerais'!$B8:$I1048576,8,0)","v":52},null,null,null,4,{"$f":"COUNTIF($E$12:$J$32,N12)","v":5},{"$f":"O12","v":5}]
[null,null,{"$f":"COUNT('Resultados Gerais'!$B8:$B1048576) -1","v":1506},{"$f":"VLOOKUP(C13,'Resultados Gerais'!B8:$C1048576,2,0)","v":"2013-06-26"},{"$f":"VLOOKUP(C13,'Resultados Gerais'!$B8:$I1048576,3,0)","v":49},{"$f":"VLOOKUP(C13,'Resultados Gerais'!$B8:$I1048576,4,0)","v":34},{"$f":"VLOOKUP(C13,'Resultados Gerais'!$B8:$I1048576,5,0)","v":42},{"$f":"VLOOKUP(C13,'Resultados Gerais'!$B8:$I1048576,6,0)","v":18},{"$f":"VLOOKUP(C13,'Resultados Gerais'!$B8:$I1048576,7,0)","v":3},{"$f":"VLOOKUP(C13,'Resultados Gerais'!$B8:$I1048576,8,0)","v":14},null,null,null,1,{"$f":"COUNTIF($E$12:$J$32,N13)","v":4},{"$f":"O13","v":4}]
[null,null,{"$f":"COUNT('Resultados Gerais'!$B8:$B1048576)-2","v":1505},{"$f":"VLOOKUP(C14,'Resultados Gerais'!B8:$C1048576,2,0)","v":"2013-06-22"},{"$f":"VLOOKUP(C14,'Resultados Gerais'!$B8:$I1048576,3,0)","v":32},{"$f":"VLOOKUP(C14,'Resultados Gerais'!$B8:$I1048576,4,0)","v":1},{"$f":"VLOOKUP(C14,'Resultados Gerais'!$B8:$I1048576,5,0)","v":6},{"$f":"VLOOKUP(C14,'Resultados Gerais'!$B8:$I1048576,6,0)","v":9},{"$f":"VLOOKUP(C14,'Resultados Gerais'!$B8:$I1048576,7,0)","v":16},{"$f":"VLOOKUP(C14,'Resultados Gerais'!$B8:$I1048576,8,0)","v":2},null,null,null,22,{"$f":"COUNTIF($E$12:$J$32,N14)","v":4},4]
[null,null,{"$f":"COUNT('Resultados Gerais'!$B8:$B1048576)-3","v":1504},{"$f":"VLOOKUP(C15,'Resultados Gerais'!B8:$C1048576,2,0)","v":"2013-06-19"},{"$f":"VLOOKUP(C15,'Resultados Gerais'!$B8:$I1048576,3,0)","v":41},{"$f":"VLOOKUP(C15,'Resultados Gerais'!$B8:$I1048576,4,0)","v":2},{"$f":"VLOOKUP(C15,'Resultados Gerais'!$B8:$I1048576,5,0)","v":42},{"$f":"VLOOKUP(C15,'Resultados Gerais'!$B8:$I1048576,6,0)","v":30},{"$f":"VLOOKUP(C15,'Resultados Gerais'!$B8:$I1048576,7,0)","v":12},{"$f":"VLOOKUP(C15,'Resultados Gerais'!$B8:$I1048576,8,0)","v":10},null,null,null,49,{"$f":"COUNTIF($E$12:$J$32,N15)","v":4},4]
{"$rows_left_out":57}
{"sheet":"50 Últimos Sorteios","index":4,"n_rows":71,"n_cols":17,"rows_kept":71,"cut":false,"hidden":false,"merged":[[8,14,9,15],[8,3,9,10],[5,1,5,18],[1,1,1,18],[2,1,2,18],[3,1,3,18]]}
[]
[null,"Atenção!"]
[null,"Esta planilha é de uso pessoal, é restritamente proibida a distribuição da mesma a terceiros, sujeito a punições de acordo com as leis de direitos autorais"]
[null,"Todos os direitos reservados ao site www.ApostaEsperta.com "]
[]
[null,"Planilha de Análise Estatística Mega Sena"]
[]
[]
[null,null,null,"Resultados dos Últimos 50 Sorteios",null,null,null,null,null,null,null,null,null,null,"Números Quentes Últimos 50 Sorteios"]
[]
[null,null,null,"Sorteio","Data do Sorteio","1ª Dezena","2ª Dezena","3ª Dezena","4ª Dezena","5ª Dezena","6ª Dezena",null,null,null,"Dezenas","Qtd de Saída"]
[null,null,null,{"$f":"COUNT('Resultados Gerais'!$B8:$B1048576)","v":1507},{"$f":"VLOOKUP(D12,'Resultados Gerais'!$B8:$C1048576,2,0)","v":"2013-06-29"},{"$f":"VLOOKUP(D12,'Resultados Gerais'!$B8:$I1048576,3,0)","v":46},{"$f":"VLOOKUP(D12,'Resultados Gerais'!$B8:$I1048576,4,0)","v":24},{"$f":"VLOOKUP(D12,'Resultados Gerais'!$B8:$I1048576,5,0)","v":51},{"$f":"VLOOKUP(D12,'Resultados Gerais'!$B8:$I1048576,6,0)","v":50},{"$f":"VLOOKUP(D12,'Resultados Gerais'!$B8:$I1048576,7,0)","v":56},{"$f":"VLOOKUP(D12,'Resultados Gerais'!$B8:$I1048576,8,0)","v":52},null,null,null,4,{"$f":"COUNTIF($F$12:$K$62,O12)","v":13},{"$f":"P12","v":13}]
[null,null,1,{"$f":"COUNT('Resultados Gerais'!$B8:$B1048576) -1","v":1506},{"$f":"VLOOKUP(D13,'Resultados Gerais'!B8:$C1048576,2,0)","v":"2013-06-26"},{"$f":"VLOOKUP(D13,'Resultados Gerais'!$B8:$I1048576,3,0)","v":49},{"$f":"VLOOKUP(D13,'Resultados Gerais'!$B8:$I1048576,4,0)","v":34},{"$f":"VLOOKUP(D13,'Resultados Gerais'!$B8:$I1048576,5,0)","v":42},{"$f":"VLOOKUP(D13,'Resultados Gerais'!$B8:$I1048576,6,0)","v":18},{"$f":"VLOOKUP(D13,'Resultados Gerais'!$B8:$I1048576,7,0)","v":3},{"$f":"VLOOKUP(D13,'Resultados Gerais'!$B8:$I1048576,8,0)","v":14},null,null,null,2,{"$f":"COUNTIF($F$12:$K$62,O13)","v":10},{"$f":"P13","v":10}]
[null,null,2,{"$f":"COUNT('Resultados Gerais'!$B8:$B1048576)-2","v":1505},{"$f":"VLOOKUP(D14,'Resultados Gerais'!B8:$C1048576,2,0)","v":"2013-06-22"},{"$f":"VLOOKUP(D14,'Resultados Gerais'!$B8:$I1048576,3,0)","v":32},{"$f":"VLOOKUP(D14,'Resultados Gerais'!$B8:$I1048576,4,0)","v":1},{"$f":"VLOOKUP(D14,'Resultados Gerais'!$B8:$I1048576,5,0)","v":6},{"$f":"VLOOKUP(D14,'Resultados Gerais'!$B8:$I1048576,6,0)","v":9},{"$f":"VLOOKUP(D14,'Resultados Gerais'!$B8:$I1048576,7,0)","v":16},{"$f":"VLOOKUP(D14,'Resultados Gerais'!$B8:$I1048576,8,0)","v":2},null,null,null,54,{"$f":"COUNTIF($F$12:$K$62,O14)","v":9},9]
[null,null,3,{"$f":"COUNT('Resultados Gerais'!$B8:$B1048576)-3","v":1504},{"$f":"VLOOKUP(D15,'Resultados Gerais'!B8:$C1048576,2,0)","v":"2013-06-19"},{"$f":"VLOOKUP(D15,'Resultados Gerais'!$B8:$I1048576,3,0)","v":41},{"$f":"VLOOKUP(D15,'Resultados Gerais'!$B8:$I1048576,4,0)","v":2},{"$f":"VLOOKUP(D15,'Resultados Gerais'!$B8:$I1048576,5,0)","v":42},{"$f":"VLOOKUP(D15,'Resultados Gerais'!$B8:$I1048576,6,0)","v":30},{"$f":"VLOOKUP(D15,'Resultados Gerais'!$B8:$I1048576,7,0)","v":12},{"$f":"VLOOKUP(D15,'Resultados Gerais'!$B8:$I1048576,8,0)","v":10},null,null,null,6,{"$f":"COUNTIF($F$12:$K$62,O15)","v":9},9]
{"$rows_left_out":57}
{"sheet":"100 Últimos Sorteios","index":5,"n_rows":111,"n_cols":17,"rows_kept":111,"cut":false,"hidden":false,"merged":[[8,14,9,15],[8,3,9,10],[5,1,5,18],[1,1,1,18],[2,1,2,18],[3,1,3,18]]}
[]
[null,"Atenção!"]
[null,"Esta planilha é de uso pessoal, é restritamente proibida a distribuição da mesma a terceiros, sujeito a punições de acordo com as leis de direitos autorais"]
[null,"Todos os direitos reservados ao site www.ApostaEsperta.com "]
[]
[null,"Planilha de Análise Estatística Mega Sena"]
[]
[]
[null,null,null,"Resultados dos Últimos 100 Sorteios",null,null,null,null,null,null,null,null,null,null,"Números Quentes Últimos 100 Sorteios"]
[]
[null,null,null,"Sorteio","Data do Sorteio","1ª Dezena","2ª Dezena","3ª Dezena","4ª Dezena","5ª Dezena","6ª Dezena",null,null,null,"Dezenas","Qtd de Saída"]
[null,null,null,{"$f":"COUNT('Resultados Gerais'!$B8:$B1048576)","v":1507},{"$f":"VLOOKUP(D12,'Resultados Gerais'!$B8:$C1048576,2,0)","v":"2013-06-29"},{"$f":"VLOOKUP(D12,'Resultados Gerais'!$B8:$I1048576,3,0)","v":46},{"$f":"VLOOKUP(D12,'Resultados Gerais'!$B8:$I1048576,4,0)","v":24},{"$f":"VLOOKUP(D12,'Resultados Gerais'!$B8:$I1048576,5,0)","v":51},{"$f":"VLOOKUP(D12,'Resultados Gerais'!$B8:$I1048576,6,0)","v":50},{"$f":"VLOOKUP(D12,'Resultados Gerais'!$B8:$I1048576,7,0)","v":56},{"$f":"VLOOKUP(D12,'Resultados Gerais'!$B8:$I1048576,8,0)","v":52},null,null,null,2,{"$f":"COUNTIF($F$12:$K$112,O12)","v":19},{"$f":"P12","v":19}]
[null,null,1,{"$f":"COUNT('Resultados Gerais'!$B8:$B1048576) -1","v":1506},{"$f":"VLOOKUP(D13,'Resultados Gerais'!B8:$C1048576,2,0)","v":"2013-06-26"},{"$f":"VLOOKUP(D13,'Resultados Gerais'!$B8:$I1048576,3,0)","v":49},{"$f":"VLOOKUP(D13,'Resultados Gerais'!$B8:$I1048576,4,0)","v":34},{"$f":"VLOOKUP(D13,'Resultados Gerais'!$B8:$I1048576,5,0)","v":42},{"$f":"VLOOKUP(D13,'Resultados Gerais'!$B8:$I1048576,6,0)","v":18},{"$f":"VLOOKUP(D13,'Resultados Gerais'!$B8:$I1048576,7,0)","v":3},{"$f":"VLOOKUP(D13,'Resultados Gerais'!$B8:$I1048576,8,0)","v":14},null,null,null,4,{"$f":"COUNTIF($F$12:$K$112,O13)","v":17},{"$f":"P13","v":17}]
[null,null,2,{"$f":"COUNT('Resultados Gerais'!$B8:$B1048576)-2","v":1505},{"$f":"VLOOKUP(D14,'Resultados Gerais'!B8:$C1048576,2,0)","v":"2013-06-22"},{"$f":"VLOOKUP(D14,'Resultados Gerais'!$B8:$I1048576,3,0)","v":32},{"$f":"VLOOKUP(D14,'Resultados Gerais'!$B8:$I1048576,4,0)","v":1},{"$f":"VLOOKUP(D14,'Resultados Gerais'!$B8:$I1048576,5,0)","v":6},{"$f":"VLOOKUP(D14,'Resultados Gerais'!$B8:$I1048576,6,0)","v":9},{"$f":"VLOOKUP(D14,'Resultados Gerais'!$B8:$I1048576,7,0)","v":16},{"$f":"VLOOKUP(D14,'Resultados Gerais'!$B8:$I1048576,8,0)","v":2},null,null,null,6,{"$f":"COUNTIF($F$12:$K$112,O14)","v":17},17]
[null,null,3,{"$f":"COUNT('Resultados Gerais'!$B8:$B1048576)-3","v":1504},{"$f":"VLOOKUP(D15,'Resultados Gerais'!B8:$C1048576,2,0)","v":"2013-06-19"},{"$f":"VLOOKUP(D15,'Resultados Gerais'!$B8:$I1048576,3,0)","v":41},{"$f":"VLOOKUP(D15,'Resultados Gerais'!$B8:$I1048576,4,0)","v":2},{"$f":"VLOOKUP(D15,'Resultados Gerais'!$B8:$I1048576,5,0)","v":42},{"$f":"VLOOKUP(D15,'Resultados Gerais'!$B8:$I1048576,6,0)","v":30},{"$f":"VLOOKUP(D15,'Resultados Gerais'!$B8:$I1048576,7,0)","v":12},{"$f":"VLOOKUP(D15,'Resultados Gerais'!$B8:$I1048576,8,0)","v":10},null,null,null,52,{"$f":"COUNTIF($F$12:$K$112,O15)","v":17},17]
{"$rows_left_out":96}