{"text_format":"1","workbook":"xlsx","n_sheets":6,"sheets":["Resultados Gerais","Total de Saída de Cada Dezena","10 Últimos Sorteios","20 Últimos Sorteios","50 Últimos Sorteios","100 Últimos Sorteios"],"not_rendered":{"charts":1,"images":3,"macros":1,"external_links":0,"defined_names":6,"comments":0,"pivot_tables":0},"unopened":[],"bounds":{"document_bytes":16777216,"sheet_cells":100000,"rows_first":2000,"rows_last":500,"rows_between":2000,"halvings":0,"cell_chars":16384,"cell_head_chars":4096},"cells_cut":0,"cells_raw":0,"read":"whole","date_system":"1900"}

{"sheet":"Resultados Gerais","index":0,"n_rows":1181,"n_cols":31,"rows_kept":1181,"cut":false,"hidden":false,"merged":[[5,1,5,9],[1,1,1,8],[2,1,2,8],[3,1,3,8]]}
[]
[null,"Atenção!"]
[null,"Esta planilha é de uso pessoal, é restritamente proibida a distribuição da mesma a terceiros, sujeito a punições de acordo com as leis de direitos autorais"]
[null,"Todos os direitos reservados ao site www.ApostaEsperta.com "]
[]
[null,"Planilha de Análise Estatística Dupla Sena"]
[null,"Concurso","Data Sorteio","1º número_Sorteio1","2º número_Sorteio1","3º número_Sorteio1","4º número_Sorteio1","5º número_Sorteio1","6º número_Sorteio1","Arrecadação_Total","Ganhadores_Sena_Sorteio1","Rateio_Sena_Sorteio1","Ganhadores_Quina_Sorteio1","Rateio_Quina_Sorteio1","Ganhadores_Quadra_Sorteio1","Rateio_Quadra_Sorteio1","Acumulado_Sena_Sorteio1","Valor_Acumulado_Sena_Sorteio1","1º número_Sorteio2","2º número_Sorteio2","3º número_Sorteio2","4º número_Sorteio2","5º número_Sorteio2","6º número_Sorteio2","Ganhadores_Sena_Sorteio2","Rateio_Sena_Sorteio2","Ganhadores_Quina_Sorteio2","Rateio_Quina_Sorteio2","Ganhadores_Quadra_Sorteio2","Rateio_Quadra_Sorteio2","Estimativa_Prêmio"]
[null,1,"2001-11-06",41,48,15,7,24,50,0,0,0,0,0,0,0,"SIM",588519.68000000005,43,37,41,49,44,9,0,0,55,2317.59,1307,97.16,0]
[null,2,"2001-11-09",11,38,32,4,9,42,0,0,0,0,0,0,0,"SIM",867336.46,13,9,46,29,19,24,0,0,35,2655.4,2014,45.98,0]
[null,3,"2001-11-13",42,34,11,44,45,47,0,0,0,0,0,0,0,"SIM",1164691.74,24,47,48,30,40,12,0,0,21,4719.93,1264,78.13,0]
[null,4,"2001-11-16",38,44,50,46,43,29,0,0,0,0,0,0,0,"SIM",1420727.93,44,46,2,7,49,11,0,0,8,10668.17,1042,81.59,0]
[null,5,"2001-11-20",32,16,12,40,25,7,0,0,0,0,0,0,0,"SIM",1720949.6,12,19,3,49,10,26,0,0,34,2943.35,1804,55.26,0]
[null,6,"2001-11-23",16,14,31,13,41,9,0,0,0,0,0,0,0,"SIM",2070565.76,2,31,42,35,36,47,0,0,16,7283.67,1160,100.09,0]
[null,7,"2001-11-27",24,32,9,17,6,23,0,0,0,0,0,0,0,"SIM",2435460.4500000002,45,30,5,28,32,8,0,0,35,3475.19,2040,59.4,0]
[null,8,"2001-11-30",29,32,11,39,38,24,0,0,0,0,0,0,0,"SIM",2770141.78,39,2,30,31,17,14,0,0,22,5070.93,1279,86.89,0]
{"$rows_left_out":1167}
{"sheet":"Total de Saída de Cada Dezena","index":1,"n_rows":57,"n_cols":3,"rows_kept":57,"cut":false,"hidden":false,"merged":[[5,1,5,9],[1,1,1,19],[2,1,2,19],[3,1,3,19]]}
[]
[null,"Atenção!"]
[null,"Esta planilha é de uso pessoal, é restritamente proibida a distribuição da mesma a terceiros, sujeito a punições de acordo com as leis de direitos autorais"]
[null,"Todos os direitos reservados ao site www.ApostaEsperta.com "]
[]
[null,"Planilha de Análise Estatística Dupla Sena"]
[null,"Dezena","Total de Saída"]
[null,1,{"$f":"COUNTIF('Resultados Gerais'!D8:I1048576,B8)","v":147}]
[null,2,{"$f":"COUNTIF('Resultados Gerais'!D8:I1048576,B9)","v":124}]
[null,3,{"$f":"COUNTIF('Resultados Gerais'!D8:I1048576,B10)","v":139}]
[null,4,{"$f":"COUNTIF('Resultados Gerais'!D8:I1048576,B11)","v":153}]
[null,5,{"$f":"COUNTIF('Resultados Gerais'!D8:I1048576,B12)","v":134}]
[null,6,{"$f":"COUNTIF('Resultados Gerais'!D8:I1048576,B13)","v":149}]
[null,7,{"$f":"COUNTIF('Resultados Gerais'!D8:I1048576,B14)","v":141}]
[null,8,{"$f":"COUNTIF('Resultados Gerais'!D8:I1048576,B15)","v":148}]
{"$rows_left_out":43}
{"sheet":"10 Últimos Sorteios","index":2,"n_rows":61,"n_cols":17,"rows_kept":61,"cut":false,"hidden":false,"merged":[[8,14,9,15],[8,3,9,10],[5,1,5,18],[1,1,1,18],[2,1,2,18],[3,1,3,18]]}
[]
[null,"Atenção!"]
[null,"Esta planilha é de uso pessoal, é restritamente proibida a distribuição da mesma a terceiros, sujeito a punições de acordo com as leis de direitos autorais"]
[null,"Todos os direitos reservados ao site www.ApostaEsperta.com "]
[]
[null,"Planilha de Análise Estatística Dupla Sena"]
[]
[]
[null,null,null,"Resultados dos Últimos 10 Sorteios",null,null,null,null,null,null,null,null,null,null,"Números Quentes\nÚtimos 10 Sorteios"]
[]
[null,null,null,"Sorteio","Data do Sorteio","1ª Dezena","2ª Dezena","3ª Dezena","4ª Dezena","5ª Dezena","6ª Dezena",null,null,null,"Dezena","Qtd de Saída"]
[null,null,null,{"$f":"COUNT('Resultados Gerais'!B8:B1048576)-C12","v":1174},{"$f":"VLOOKUP(D12,'Resultados Gerais'!B$8:C$1048576,2,0)","v":"2013-05-07"},{"$f":"VLOOKUP(D12,'Resultados Gerais'!$B$8:$I$1048576,3,0)","v":47},{"$f":"VLOOKUP(D12,'Resultados Gerais'!$B$8:$I$1048576,4,0)","v":42},{"$f":"VLOOKUP(D12,'Resultados Gerais'!$B$8:$I$1048576,5,0)","v":26},{"$f":"VLOOKUP(D12,'Resultados Gerais'!$B$8:$I$1048576,6,0)","v":10},{"$f":"VLOOKUP(D12,'Resultados Gerais'!$B$8:$I$1048576,7,0)","v":4},{"$f":"VLOOKUP(D12,'Resultados Gerais'!$B$8:$I$1048576,8,0)","v":9},null,null,null,26,{"$f":"COUNTIF($F$12:$K$22,O12)","v":6},{"$f":"P12","v":6}]
[null,null,1,{"$f":"COUNT('Resultados Gerais'!B8:B1048576)-C13","v":1173},{"$f":"VLOOKUP(D13,'Resultados Gerais'!B$8:C$1048576,2,0)","v":"2013-05-03"},{"$f":"VLOOKUP(D13,'Resultados Gerais'!$B$8:$I$1048576,3,0)","v":35},{"$f":"VLOOKUP(D13,'Resultados Gerais'!$B$8:$I$1048576,4,0)","v":26},{"$f":"VLOOKUP(D13,'Resultados Gerais'!$B$8:$I$1048576,5,0)","v":44},{"$f":"VLOOKUP(D13,'Resultados Gerais'!$B$8:$I$1048576,6,0)","v":21},{"$f":"VLOOKUP(D13,'Resultados Gerais'!$B$8:$I$1048576,7,0)","v":11},{"$f":"VLOOKUP(D13,'Resultados Gerais'!$B$8:$I$1048576,8,0)","v":1},null,null,null,41,4,{"$f":"P13","v":4}]
[null,null,2,{"$f":"COUNT('Resultados Gerais'!B8:B1048576)-C14","v":1172},{"$f":"VLOOKUP(D14,'Resultados Gerais'!B$8:C$1048576,2,0)","v":"2013-04-30"},{"$f":"VLOOKUP(D14,'Resultados Gerais'!$B$8:$I$1048576,3,0)","v":16},{"$f":"VLOOKUP(D14,'Resultados Gerais'!$B$8:$I$1048576,4,0)","v":40},{"$f":"VLOOKUP(D14,'Resultados Gerais'!$B$8:$I$1048576,5,0)","v":41},{"$f":"VLOOKUP(D14,'Resultados Gerais'!$B$8:$I$1048576,6,0)","v":25},{"$f":"VLOOKUP(D14,'Resultados Gerais'!$B$8:$I$1048576,7,0)","v":46},{"$f":"VLOOKUP(D14,'Resultados Gerais'!$B$8:$I$1048576,8,0)","v":13},null,null,null,3,3,3]
[null,null,3,{"$f":"COUNT('Resultados Gerais'!B8:B1048576)-C15","v":1171},{"$f":"VLOOKUP(D15,'Resultados Gerais'!B$8:C$1048576,2,0)","v":"2013-04-26"},{"$f":"VLOOKUP(D15,'Resultados Gerais'!$B$8:$I$1048576,3,0)","v":19},{"$f":"VLOOKUP(D15,'Resultados Gerais'!$B$8:$I$1048576,4,0)","v":44},{"$f":"VLOOKUP(D15,'Resultados Gerais'!$B$8:$I$1048576,5,0)","v":26},{"$f":"VLOOKUP(D15,'Resultados Gerais'!$B$8:$I$1048576,6,0)","v":22},{"$f":"VLOOKUP(D15,'Resultados Gerais'!$B$8:$I$1048576,7,0)","v":32},{"$f":"VLOOKUP(D15,'Resultados Gerais'!$B$8:$I$1048576,8,0)","v":43},null,null,null,4,3,3]
{"$rows_left_out":47}
{"sheet":"20 Últimos Sorteios","index":3,"n_rows":61,"n_cols":17,"rows_kept":61,"cut":false,"hidden":false,"merged":[[8,14,9,15],[8,3,9,10],[5,1,5,18],[1,1,1,18],[2,1,2,18],[3,1,3,18]]}
[]
[null,"Atenção!"]
[null,"Esta planilha é de uso pessoal, é restritamente proibida a distribuição da mesma a terceiros, sujeito a punições de acordo com as leis de direitos autorais"]
[null,"Todos os direitos reservados ao site www.ApostaEsperta.com "]
[]
[null,"Planilha de Análise Estatística Dupla Sena"]
[]
[]
[null,null,null,"Resultados dos Últimos 20 Sorteios",null,null,null,null,null,null,null,null,null,null,"Números Quentes\nÚtimos 20 Sorteios"]
[]
[null,null,null,"Sorteio","Data do Sorteio","1ª Dezena","2ª Dezena","3ª Dezena","4ª Dezena","5ª Dezena","6ª Dezena",null,null,null,"Dezena","Qtd de Saída"]
[null,null,null,{"$f":"COUNT('Resultados Gerais'!B8:B1048576)-C12","v":1174},{"$f":"VLOOKUP(D12,'Resultados Gerais'!B$8:C$1048576,2,0)","v":"2013-05-07"},{"$f":"VLOOKUP(D12,'Resultados Gerais'!$B$8:$I$1048576,3,0)","v":47},{"$f":"VLOOKUP(D12,'Resultados Gerais'!$B$8:$I$1048576,4,0)","v":42},{"$f":"VLOOKUP(D12,'Resultados Gerais'!$B$8:$I$1048576,5,0)","v":26},{"$f":"VLOOKUP(D12,'Resultados Gerais'!$B$8:$I$1048576,6,0)","v":10},{"$f":"VLOOKUP(D12,'Resultados Gerais'!$B$8:$I$1048576,7,0)","v":4},{"$f":"VLOOKUP(D12,'Resultados Gerais'!$B$8:$I$1048576,8,0)","v":9},null,null,null,44,{"$f":"COUNTIF($F$12:$K$32,O12)","v":7},{"$f":"P12","v":7}]
[null,null,1,{"$f":"COUNT('Resultados Gerais'!B8:B1048576)-C13","v":1173},{"$f":"VLOOKUP(D13,'Resultados Gerais'!B$8:C$1048576,2,0)","v":"2013-05-03"},{"$f":"VLOOKUP(D13,'Resultados Gerais'!$B$8:$I$1048576,3,0)","v":35},{"$f":"VLOOKUP(D13,'Resultados Gerais'!$B$8:$I$1048576,4,0)","v":26},{"$f":"VLOOKUP(D13,'Resultados Gerais'!$B$8:$I$1048576,5,0)","v":44},{"$f":"VLOOKUP(D13,'Resultados Gerais'!$B$8:$I$1048576,6,0)","v":21},{"$f":"VLOOKUP(D13,'Resultados Gerais'!$B$8:$I$1048576,7,0)","v":11},{"$f":"VLOOKUP(D13,'Resultados Gerais'!$B$8:$I$1048576,8,0)","v":1},null,null,null,19,7,{"$f":"P13","v":7}]
[null,null,2,{"$f":"COUNT('Resultados Gerais'!B8:B1048576)-C14","v":1172},{"$f":"VLOOKUP(D14,'Resultados Gerais'!B$8:C$1048576,2,0)","v":"2013-04-30"},{"$f":"VLOOKUP(D14,'Resultados Gerais'!$B$8:$I$1048576,3,0)","v":16},{"$f":"VLOOKUP(D14,'Resultados Gerais'!$B$8:$I$1048576,4,0)","v":40},{"$f":"VLOOKUP(D14,'Resultados Gerais'!$B$8:$I$1048576,5,0)","v":41},{"$f":"VLOOKUP(D14,'Resultados Gerais'!$B$8:$I$1048576,6,0)","v":25},{"$f":"VLOOKUP(D14,'Resultados Gerais'!$B$8:$I$1048576,7,0)","v":46},{"$f":"VLOOKUP(D14,'Resultados Gerais'!$B$8:$I$1048576,8,0)","v":13},null,null,null,26,6,6]
[null,null,3,{"$f":"COUNT('Resultados Gerais'!B8:B1048576)-C15","v":1171},{"$f":"VLOOKUP(D15,'Resultados Gerais'!B$8:C$1048576,2,0)","v":"2013-04-26"},{"$f":"VLOOKUP(D15,'Resultados Gerais'!$B$8:$I$1048576,3,0)","v":19},{"$f":"VLOOKUP(D15,'Resultados Gerais'!$B$8:$I$1048576,4,0)","v":44},{"$f":"VLOOKUP(D15,'Resultados Gerais'!$B$8:$I$1048576,5,0)","v":26},{"$f":"VLOOKUP(D15,'Resultados Gerais'!$B$8:$I$1048576,6,0)","v":22},{"$f":"VLOOKUP(D15,'Resultados Gerais'!$B$8:$I$1048576,7,0)","v":32},{"$f":"VLOOKUP(D15,'Resultados Gerais'!$B$8:$I$1048576,8,0)","v":43},null,null,null,4,6,6]
{"$rows_left_out":47}
{"sheet":"50 Últimos Sorteios","index":4,"n_rows":62,"n_cols":17,"rows_kept":62,"cut":false,"hidden":false,"merged":[[8,14,9,15],[8,3,9,10],[5,1,5,18],[1,1,1,18],[2,1,2,18],[3,1,3,18]]}
[]
[null,"Atenção!"]
[null,"Esta planilha é de uso pessoal, é restritamente proibida a distribuição da mesma a terceiros, sujeito a punições de acordo com as leis de direitos autorais"]
[null,"Todos os direitos reservados ao site www.ApostaEsperta.com "]
[]
[null,"Planilha de Análise Estatística Dupla Sena"]
[]
[]
[null,null,null,"Resultados dos Últimos 50 Sorteios",null,null,null,null,null,null,null,null,null,null,"Números Quentes\nÚtimos 50 Sorteios"]
[]
[null,null,null,"Sorteio","Data do Sorteio","1ª Dezena","2ª Dezena","3ª Dezena","4ª Dezena","5ª Dezena","6ª Dezena",null,null,null,"Dezena","Qtd de Saída"]
[null,null,null,{"$f":"COUNT('Resultados Gerais'!B8:B1048576)-C12","v":1174},{"$f":"VLOOKUP(D12,'Resultados Gerais'!B$8:C$1048576,2,0)","v":"2013-05-07"},{"$f":"VLOOKUP(D12,'Resultados Gerais'!$B$8:$I$1048576,3,0)","v":47},{"$f":"VLOOKUP(D12,'Resultados Gerais'!$B$8:$I$1048576,4,0)","v":42},{"$f":"VLOOKUP(D12,'Resultados Gerais'!$B$8:$I$1048576,5,0)","v":26},{"$f":"VLOOKUP(D12,'Resultados Gerais'!$B$8:$I$1048576,6,0)","v":10},{"$f":"VLOOKUP(D12,'Resultados Gerais'!$B$8:$I$1048576,7,0)","v":4},{"$f":"VLOOKUP(D12,'Resultados Gerais'!$B$8:$I$1048576,8,0)","v":9},null,null,null,26,{"$f":"COUNTIF($F$12:$K$62,O12)","v":10},{"$f":"P12","v":10}]
[null,null,1,{"$f":"COUNT('Resultados Gerais'!B8:B1048576)-C13","v":1173},{"$f":"VLOOKUP(D13,'Resultados Gerais'!B$8:C$1048576,2,0)","v":"2013-05-03"},{"$f":"VLOOKUP(D13,'Resultados Gerais'!$B$8:$I$1048576,3,0)","v":35},{"$f":"VLOOKUP(D13,'Resultados Gerais'!$B$8:$I$1048576,4,0)","v":26},{"$f":"VLOOKUP(D13,'Resultados Gerais'!$B$8:$I$1048576,5,0)","v":44},{"$f":"VLOOKUP(D13,'Resultados Gerais'!$B$8:$I$1048576,6,0)","v":21},{"$f":"VLOOKUP(D13,'Resultados Gerais'!$B$8:$I$1048576,7,0)","v":11},{"$f":"VLOOKUP(D13,'Resultados Gerais'!$B$8:$I$1048576,8,0)","v":1},null,null,null,10,10,{"$f":"P13","v":10}]
[null,null,2,{"$f":"COUNT('Resultados Gerais'!B8:B1048576)-C14","v":1172},{"$f":"VLOOKUP(D14,'Resultados Gerais'!B$8:C$1048576,2,0)","v":"2013-04-30"},{"$f":"VLOOKUP(D14,'Resultados Gerais'!$B$8:$I$1048576,3,0)","v":16},{"$f":"VLOOKUP(D14,'Resultados Gerais'!$B$8:$I$1048576,4,0)","v":40},{"$f":"VLOOKUP(D14,'Resultados Gerais'!$B$8:$I$1048576,5,0)","v":41},{"$f":"VLOOKUP(D14,'Resultados Gerais'!$B$8:$I$1048576,6,0)","v":25},{"$f":"VLOOKUP(D14,'Resultados Gerais'!$B$8:$I$1048576,7,0)","v":46},{"$f":"VLOOKUP(D14,'Resultados Gerais'!$B$8:$I$1048576,8,0)","v":13},null,null,null,44,9,9]
[null,null,3,{"$f":"COUNT('Resultados Gerais'!B8:B1048576)-C15","v":1171},{"$f":"VLOOKUP(D15,'Resultados Gerais'!B$8:C$1048576,2,0)","v":"2013-04-26"},{"$f":"VLOOKUP(D15,'Resultados Gerais'!$B$8:$I$1048576,3,0)","v":19},{"$f":"VLOOKUP(D15,'Resultados Gerais'!$B$8:$I$1048576,4,0)","v":44},{"$f":"VLOOKUP(D15,'Resultados Gerais'!$B$8:$I$1048576,5,0)","v":26},{"$f":"VLOOKUP(D15,'Resultados Gerais'!$B$8:$I$1048576,6,0)","v":22},{"$f":"VLOOKUP(D15,'Resultados Gerais'!$B$8:$I$1048576,7,0)","v":32},{"$f":"VLOOKUP(D15,'Resultados Gerais'!$B$8:$I$1048576,8,0)","v":43},null,null,null,4,9,9]
{"$rows_left_out":48}
{"sheet":"100 Últimos Sorteios","index":5,"n_rows":111,"n_cols":17,"rows_kept":111,"cut":false,"hidden":false,"merged":[[8,14,9,15],[8,3,9,10],[5,1,5,18],[1,1,1,18],[2,1,2,18],[3,1,3,18]]}
[]
[null,"Atenção!"]
[null,"Esta planilha é de uso pessoal, é restritamente proibida a distribuição da mesma a terceiros, sujeito a punições de acordo com as leis de direitos autorais"]
[null,"Todos os direitos reservados ao site www.ApostaEsperta.com "]
[]
[null,"Planilha de Análise Estatística Dupla Sena"]
[]
[]
[null,null,null,"Resultados dos Últimos 100 Sorteios",null,null,null,null,null,null,null,null,null,null,"Números Quentes\nÚtimos 100 Sorteios"]
[]
[null,null,null,"Sorteio","Data do Sorteio","1ª Dezena","2ª Dezena","3ª Dezena","4ª Dezena","5ª Dezena","6ª Dezena",null,null,null,"Dezena","Qtd de Saída"]
[null,null,null,{"$f":"COUNT('Resultados Gerais'!B8:B1048576)-C12","v":1174},{"$f":"VLOOKUP(D12,'Resultados Gerais'!B$8:C$1048576,2,0)","v":"2013-05-07"},{"$f":"VLOOKUP(D12,'Resultados Gerais'!$B$8:$I$1048576,3,0)","v":47},{"$f":"VLOOKUP(D12,'Resultados Gerais'!$B$8:$I$1048576,4,0)","v":42},{"$f":"VLOOKUP(D12,'Resultados Gerais'!$B$8:$I$1048576,5,0)","v":26},{"$f":"VLOOKUP(D12,'Resultados Gerais'!$B$8:$I$1048576,6,0)","v":10},{"$f":"VLOOKUP(D12,'Resultados Gerais'!$B$8:$I$1048576,7,0)","v":4},{"$f":"VLOOKUP(D12,'Resultados Gerais'!$B$8:$I$1048576,8,0)","v":9},null,null,null,26,{"$f":"COUNTIF($F$12:$K$112,O12)","v":18},{"$f":"P12","v":18}]
[null,null,1,{"$f":"COUNT('Resultados Gerais'!B8:B1048576)-C13","v":1173},{"$f":"VLOOKUP(D13,'Resultados Gerais'!B$8:C$1048576,2,0)","v":"2013-05-03"},{"$f":"VLOOKUP(D13,'Resultados Gerais'!$B$8:$I$1048576,3,0)","v":35},{"$f":"VLOOKUP(D13,'Resultados Gerais'!$B$8:$I$1048576,4,0)","v":26},{"$f":"VLOOKUP(D13,'Resultados Gerais'!$B$8:$I$1048576,5,0)","v":44},{"$f":"VLOOKUP(D13,'Resultados Gerais'!$B$8:$I$1048576,6,0)","v":21},{"$f":"VLOOKUP(D13,'Resultados Gerais'!$B$8:$I$1048576,7,0)","v":11},{"$f":"VLOOKUP(D13,'Resultados Gerais'!$B$8:$I$1048576,8,0)","v":1},null,null,null,10,18,{"$f":"P13","v":18}]
[null,null,2,{"$f":"COUNT('Resultados Gerais'!B8:B1048576)-C14","v":1172},{"$f":"VLOOKUP(D14,'Resultados Gerais'!B$8:C$1048576,2,0)","v":"2013-04-30"},{"$f":"VLOOKUP(D14,'Resultados Gerais'!$B$8:$I$1048576,3,0)","v":16},{"$f":"VLOOKUP(D14,'Resultados Gerais'!$B$8:$I$1048576,4,0)","v":40},{"$f":"VLOOKUP(D14,'Resultados Gerais'!$B$8:$I$1048576,5,0)","v":41},{"$f":"VLOOKUP(D14,'Resultados Gerais'!$B$8:$I$1048576,6,0)","v":25},{"$f":"VLOOKUP(D14,'Resultados Gerais'!$B$8:$I$1048576,7,0)","v":46},{"$f":"VLOOKUP(D14,'Resultados Gerais'!$B$8:$I$1048576,8,0)","v":13},null,null,null,35,16,16]
[null,null,3,{"$f":"COUNT('Resultados Gerais'!B8:B1048576)-C15","v":1171},{"$f":"VLOOKUP(D15,'Resultados Gerais'!B$8:C$1048576,2,0)","v":"2013-04-26"},{"$f":"VLOOKUP(D15,'Resultados Gerais'!$B$8:$I$1048576,3,0)","v":19},{"$f":"VLOOKUP(D15,'Resultados Gerais'!$B$8:$I$1048576,4,0)","v":44},{"$f":"VLOOKUP(D15,'Resultados Gerais'!$B$8:$I$1048576,5,0)","v":26},{"$f":"VLOOKUP(D15,'Resultados Gerais'!$B$8:$I$1048576,6,0)","v":22},{"$f":"VLOOKUP(D15,'Resultados Gerais'!$B$8:$I$1048576,7,0)","v":32},{"$f":"VLOOKUP(D15,'Resultados Gerais'!$B$8:$I$1048576,8,0)","v":43},null,null,null,37,15,15]
{"$rows_left_out":96}